null
SMILES: OC(=O)[C@H](CNC(=O)c1ccc(cc1)N1CCNCC1)NS(=O)(=O)c1ccccc1
InChI Key: InChIKey=PXSDSRKJCWOYNE-SFHVURJKSA-N
Activity Spreadsheet -- Enzyme Inhibition Constant Data from BindingDB
Found 4 hits for monomerid = 50076058
Trg + Lig
Ki
nM
ΔG°
kcal/mole
IC50
nM
Kd
nM
EC50/IC50
nM
koff
s-1
kon
M-1s-1
pHTemp
°C
Integrin alpha-IIb/beta-3
(Homo sapiens (Human))
BDBM50076058
((S)-2-Benzenesulfonylamino-3-(4-piperazin-1-yl-ben...)
Show SMILES OC(=O)[C@H](CNC(=O)c1ccc(cc1)N1CCNCC1)NS(=O)(=O)c1ccccc1
Show InChI InChI=1S/C20H24N4O5S/c25-19(15-6-8-16(9-7-15)24-12-10-21-11-13-24)22-14-18(20(26)27)23-30(28,29)17-4-2-1-3-5-17/h1-9,18,21,23H,10-14H2,(H,22,25)(H,26,27)/t18-/m0/s1
n/an/a 17n/an/an/an/an/an/a
Merck Research Laboratories
Curated by ChEMBL
Assay Description
Inhibition of glycoprotein IIb/III integrin mediated fibrinogen binding to activated platelets
Bioorg Med Chem Lett 9: 863-8 (1999)
BindingDB Entry DOI: 10.7270/Q2SJ1JSK
Integrin alpha-IIb/beta-3
(Homo sapiens (Human))
BDBM50076058
((S)-2-Benzenesulfonylamino-3-(4-piperazin-1-yl-ben...)
Show SMILES OC(=O)[C@H](CNC(=O)c1ccc(cc1)N1CCNCC1)NS(=O)(=O)c1ccccc1
Show InChI InChI=1S/C20H24N4O5S/c25-19(15-6-8-16(9-7-15)24-12-10-21-11-13-24)22-14-18(20(26)27)23-30(28,29)17-4-2-1-3-5-17/h1-9,18,21,23H,10-14H2,(H,22,25)(H,26,27)/t18-/m0/s1
n/an/a 17n/an/an/an/an/an/a
COR Therapeutics, Inc.
Curated by ChEMBL
Assay Description
Inhibition of platelet aggregation
J Med Chem 43: 3453-73 (2000)
BindingDB Entry DOI: 10.7270/Q2ZS2X79
Integrin alpha-V/beta-3
(Homo sapiens (Human))
BDBM50076058
((S)-2-Benzenesulfonylamino-3-(4-piperazin-1-yl-ben...)
Show SMILES OC(=O)[C@H](CNC(=O)c1ccc(cc1)N1CCNCC1)NS(=O)(=O)c1ccccc1
Show InChI InChI=1S/C20H24N4O5S/c25-19(15-6-8-16(9-7-15)24-12-10-21-11-13-24)22-14-18(20(26)27)23-30(28,29)17-4-2-1-3-5-17/h1-9,18,21,23H,10-14H2,(H,22,25)(H,26,27)/t18-/m0/s1
n/an/a>1.00E+3n/an/an/an/an/an/a
Merck Research Laboratories
Curated by ChEMBL
Assay Description
Inhibition of binding to human Vitronectin receptor (integrin alphaV-beta3)
J Med Chem 46: 5316-25 (2003)
Article DOI: 10.1021/jm030146j
BindingDB Entry DOI: 10.7270/Q23R0S9P
Integrin alpha-IIb/beta-3
(Homo sapiens (Human))
BDBM50076058
((S)-2-Benzenesulfonylamino-3-(4-piperazin-1-yl-ben...)
Show SMILES OC(=O)[C@H](CNC(=O)c1ccc(cc1)N1CCNCC1)NS(=O)(=O)c1ccccc1
Show InChI InChI=1S/C20H24N4O5S/c25-19(15-6-8-16(9-7-15)24-12-10-21-11-13-24)22-14-18(20(26)27)23-30(28,29)17-4-2-1-3-5-17/h1-9,18,21,23H,10-14H2,(H,22,25)(H,26,27)/t18-/m0/s1
n/an/a 16n/an/an/an/an/an/a
Merck Research Laboratories
Curated by ChEMBL
Assay Description
Inhibition of human alphaIIb-beta3 integrin in platelet aggregation assay
J Med Chem 46: 5316-25 (2003)
Article DOI: 10.1021/jm030146j
BindingDB Entry DOI: 10.7270/Q23R0S9P