BDBM50076175 CHEMBL3415847
SMILES: OC(=O)C(\O)=C\C(=O)\C=C\c1cc(cn1Cc1ccccc1)C(=O)c1ccc(F)cc1
InChI Key: InChIKey=VQPMBYHMQIXPFU-SNOGGGIRSA-N
Data: 2 IC50
Activity Spreadsheet -- Enzyme Inhibition Constant Data from BindingDB
Found 2 hits for monomerid = 50076175
Trg + Lig
Ki
nM
ΔG°
kcal/mole
IC50
nM
Kd
nM
EC50/IC50
nM
koff
s-1
kon
M-1s-1
pHTemp
°C
Integrase
(Human immunodeficiency virus 1)
BDBM50076175
(CHEMBL3415847)
Show SMILES OC(=O)C(\O)=C\C(=O)\C=C\c1cc(cn1Cc1ccccc1)C(=O)c1ccc(F)cc1
Show InChI InChI=1S/C24H18FNO5/c25-19-8-6-17(7-9-19)23(29)18-12-20(10-11-21(27)13-22(28)24(30)31)26(15-18)14-16-4-2-1-3-5-16/h1-13,15,28H,14H2,(H,30,31)/b11-10+,22-13-
n/an/a 63n/an/an/an/an/an/a
Universit£ di Roma
Curated by ChEMBL
Assay Description
Inhibition of HIV-1 integrase strand transfer activity by gel-based assay
J Med Chem 58: 1915-28 (2015)
Article DOI: 10.1021/jm501799k
BindingDB Entry DOI: 10.7270/Q2QJ7JZG
Reverse transcriptase
(Human immunodeficiency virus 1)
BDBM50076175
(CHEMBL3415847)
Show SMILES OC(=O)C(\O)=C\C(=O)\C=C\c1cc(cn1Cc1ccccc1)C(=O)c1ccc(F)cc1
Show InChI InChI=1S/C24H18FNO5/c25-19-8-6-17(7-9-19)23(29)18-12-20(10-11-21(27)13-22(28)24(30)31)26(15-18)14-16-4-2-1-3-5-16/h1-13,15,28H,14H2,(H,30,31)/b11-10+,22-13-
n/an/a 7.50E+3n/an/an/an/an/an/a
Universit£ di Roma
Curated by ChEMBL
Assay Description
Inhibition of HIV-1 recombinant RT-associted RNase H activity expressed in Escherichia coli M15 using poly(dC)-[3H]poly(rG) hybrid as substrate
J Med Chem 58: 1915-28 (2015)
Article DOI: 10.1021/jm501799k
BindingDB Entry DOI: 10.7270/Q2QJ7JZG