BDBM50076176 CHEMBL3415846
SMILES: N\C(=C/C(=O)c1cn(Cc2ccc(F)cc2)cc1-c1ccccc1)C(O)=O
InChI Key: InChIKey=DFLZMXAKNICYGN-GRSHGNNSSA-N
Data: 2 IC50
Activity Spreadsheet -- Enzyme Inhibition Constant Data from BindingDB
Found 2 hits for monomerid = 50076176
Trg + Lig
Ki
nM
ΔG°
kcal/mole
IC50
nM
Kd
nM
EC50/IC50
nM
koff
s-1
kon
M-1s-1
pHTemp
°C
Integrase
(Human immunodeficiency virus 1)
BDBM50076176
(CHEMBL3415846)
Show SMILES N\C(=C/C(=O)c1cn(Cc2ccc(F)cc2)cc1-c1ccccc1)C(O)=O
Show InChI InChI=1S/C21H17FN2O3/c22-16-8-6-14(7-9-16)11-24-12-17(15-4-2-1-3-5-15)18(13-24)20(25)10-19(23)21(26)27/h1-10,12-13H,11,23H2,(H,26,27)/b19-10-
n/an/a 43n/an/an/an/an/an/a
Universit£ di Roma
Curated by ChEMBL
Assay Description
Inhibition of HIV-1 integrase strand transfer activity by gel-based assay
J Med Chem 58: 1915-28 (2015)
Article DOI: 10.1021/jm501799k
BindingDB Entry DOI: 10.7270/Q2QJ7JZG
Reverse transcriptase
(Human immunodeficiency virus 1)
BDBM50076176
(CHEMBL3415846)
Show SMILES N\C(=C/C(=O)c1cn(Cc2ccc(F)cc2)cc1-c1ccccc1)C(O)=O
Show InChI InChI=1S/C21H17FN2O3/c22-16-8-6-14(7-9-16)11-24-12-17(15-4-2-1-3-5-15)18(13-24)20(25)10-19(23)21(26)27/h1-10,12-13H,11,23H2,(H,26,27)/b19-10-
n/an/a 2.00E+3n/an/an/an/an/an/a
Universit£ di Roma
Curated by ChEMBL
Assay Description
Inhibition of HIV-1 recombinant RT-associted RNase H activity expressed in Escherichia coli M15 using poly(dC)-[3H]poly(rG) hybrid as substrate
J Med Chem 58: 1915-28 (2015)
Article DOI: 10.1021/jm501799k
BindingDB Entry DOI: 10.7270/Q2QJ7JZG