BDBM50076467 CHEMBL295819::Phosphoric acid mono-[5-(2-ethylsulfanyl-6-methylamino-purin-9-yl)-2-phosphonooxymethyl-tetrahydro-furan-3-yl] ester
SMILES: CCSc1nc(NC)c2ncn(C3CC(OP(O)(O)=O)C(COP(O)(O)=O)O3)c2n1
InChI Key: InChIKey=DZGOMQYNNHDHEU-UHFFFAOYSA-N
Data: 1 IC50
Activity Spreadsheet -- Enzyme Inhibition Constant Data from BindingDB
Found 1 hit for monomerid = 50076467
Trg + Lig
Ki
nM
ΔG°
kcal/mole
IC50
nM
Kd
nM
EC50/IC50
nM
koff
s-1
kon
M-1s-1
pHTemp
°C
P2Y purinoceptor 1
(Meleagris gallopavo)
BDBM50076467
(CHEMBL295819 | Phosphoric acid mono-[5-(2-ethylsul...)
Show SMILES CCSc1nc(NC)c2ncn(C3CC(OP(O)(O)=O)C(COP(O)(O)=O)O3)c2n1
Show InChI InChI=1S/C13H21N5O9P2S/c1-3-30-13-16-11(14-2)10-12(17-13)18(6-15-10)9-4-7(27-29(22,23)24)8(26-9)5-25-28(19,20)21/h6-9H,3-5H2,1-2H3,(H,14,16,17)(H2,19,20,21)(H2,22,23,24)
n/an/a 980n/an/an/an/an/an/a
National Institute of Diabetes
Curated by ChEMBL
Assay Description
In vitro antagonist activity at P2Y1 receptor in turkey erythrocyte membranes.
J Med Chem 42: 1625-38 (1999)
Article DOI: 10.1021/jm980657j
BindingDB Entry DOI: 10.7270/Q28C9WZM