BDBM50076470 CHEMBL42028::Phosphoric acid mono-[5-(2-iodo-6-methylamino-purin-9-yl)-2-phosphonooxymethyl-tetrahydro-furan-3-yl] ester
SMILES: CNc1nc(I)nc2n(cnc12)C1CC(OP(O)(O)=O)C(COP(O)(O)=O)O1
InChI Key: InChIKey=JFQFIUWCEZBDNH-UHFFFAOYSA-N
Data: 1 IC50  1 EC50
Activity Spreadsheet -- Enzyme Inhibition Constant Data from BindingDB
Found 2 hits for monomerid = 50076470
Trg + Lig
Ki
nM
ΔG°
kcal/mole
IC50
nM
Kd
nM
EC50/IC50
nM
koff
s-1
kon
M-1s-1
pHTemp
°C
P2Y purinoceptor 1
(Meleagris gallopavo)
BDBM50076470
(CHEMBL42028 | Phosphoric acid mono-[5-(2-iodo-6-me...)
Show SMILES CNc1nc(I)nc2n(cnc12)C1CC(OP(O)(O)=O)C(COP(O)(O)=O)O1
Show InChI InChI=1S/C11H16IN5O9P2/c1-13-9-8-10(16-11(12)15-9)17(4-14-8)7-2-5(26-28(21,22)23)6(25-7)3-24-27(18,19)20/h4-7H,2-3H2,1H3,(H,13,15,16)(H2,18,19,20)(H2,21,22,23)
n/an/an/an/a 4.44E+3n/an/an/an/a
National Institute of Diabetes
Curated by ChEMBL
Assay Description
Concentration at which 50% of the maximal effect (stimulation of PLC at P2Y1 receptor in the turkey erythrocyte membranes) is reached
J Med Chem 42: 1625-38 (1999)
Article DOI: 10.1021/jm980657j
BindingDB Entry DOI: 10.7270/Q28C9WZM
P2Y purinoceptor 1
(Meleagris gallopavo)
BDBM50076470
(CHEMBL42028 | Phosphoric acid mono-[5-(2-iodo-6-me...)
Show SMILES CNc1nc(I)nc2n(cnc12)C1CC(OP(O)(O)=O)C(COP(O)(O)=O)O1
Show InChI InChI=1S/C11H16IN5O9P2/c1-13-9-8-10(16-11(12)15-9)17(4-14-8)7-2-5(26-28(21,22)23)6(25-7)3-24-27(18,19)20/h4-7H,2-3H2,1H3,(H,13,15,16)(H2,18,19,20)(H2,21,22,23)
n/an/a 891n/an/an/an/an/an/a
National Institute of Diabetes
Curated by ChEMBL
Assay Description
In vitro antagonist activity at P2Y1 receptor in turkey erythrocyte membranes.
J Med Chem 42: 1625-38 (1999)
Article DOI: 10.1021/jm980657j
BindingDB Entry DOI: 10.7270/Q28C9WZM