BDBM50076670 CHEMBL3416559
SMILES: Cc1ccc(Cn2c(CN3CCN(CC3)c3ccccc3)nc3n(C)c(=O)n(C)c(=O)c23)cc1
InChI Key: InChIKey=GMVUMBGIYUUGGN-UHFFFAOYSA-N
Data: 2 IC50
Activity Spreadsheet -- Enzyme Inhibition Constant Data from BindingDB
Found 2 hits for monomerid = 50076670
Trg + Lig
Ki
nM
ΔG°
kcal/mole
IC50
nM
Kd
nM
EC50/IC50
nM
koff
s-1
kon
M-1s-1
pHTemp
°C
Aldehyde dehydrogenase X, mitochondrial
(Homo sapiens (Human))
BDBM50076670
(CHEMBL3416559)
Show SMILES Cc1ccc(Cn2c(CN3CCN(CC3)c3ccccc3)nc3n(C)c(=O)n(C)c(=O)c23)cc1
Show InChI InChI=1S/C26H30N6O2/c1-19-9-11-20(12-10-19)17-32-22(27-24-23(32)25(33)29(3)26(34)28(24)2)18-30-13-15-31(16-14-30)21-7-5-4-6-8-21/h4-12H,13-18H2,1-3H3
n/an/a>1.00E+5n/an/an/an/an/an/a
Indiana University
Curated by ChEMBL
Assay Description
Inhibition of recombinant human ALDH1B1 using propionaldehyde as substrate preincubated for 2 mins with NAD+ followed by substrate addition by UV-Vis...
J Med Chem 58: 1964-75 (2015)
Article DOI: 10.1021/jm501900s
BindingDB Entry DOI: 10.7270/Q22V2HTK
Aldehyde dehydrogenase 1A1 (ALDH1A1)
(Homo sapiens (Human))
BDBM50076670
(CHEMBL3416559)
Show SMILES Cc1ccc(Cn2c(CN3CCN(CC3)c3ccccc3)nc3n(C)c(=O)n(C)c(=O)c23)cc1
Show InChI InChI=1S/C26H30N6O2/c1-19-9-11-20(12-10-19)17-32-22(27-24-23(32)25(33)29(3)26(34)28(24)2)18-30-13-15-31(16-14-30)21-7-5-4-6-8-21/h4-12H,13-18H2,1-3H3
Reactome pathway
n/an/a 2.10E+3n/an/an/an/an/an/a
Indiana University
Curated by ChEMBL
Assay Description
Inhibition of recombinant human ALDH1A1 using propionaldehyde as substrate preincubated for 2 mins with NAD+ followed by substrate addition by UV-Vis...
J Med Chem 58: 1964-75 (2015)
Article DOI: 10.1021/jm501900s
BindingDB Entry DOI: 10.7270/Q22V2HTK