BDBM50077084 4-{[Benzyl-(2-dimethylamino-ethyl)-amino]-phenyl-methyl}-N,N-diethyl-benzamide::CHEMBL28443
SMILES: CCN(CC)C(=O)c1ccc(cc1)C(N(CCN(C)C)Cc1ccccc1)c1ccccc1
InChI Key: InChIKey=CLUPMQGKRZBFDZ-UHFFFAOYSA-N
Data: 3 IC50
Activity Spreadsheet -- Enzyme Inhibition Constant Data from BindingDB
Found 3 hits for monomerid = 50077084
Trg + Lig
Ki
nM
ΔG°
kcal/mole
IC50
nM
Kd
nM
EC50/IC50
nM
koff
s-1
kon
M-1s-1
pHTemp
°C
Delta-type opioid receptor
(Homo sapiens (Human))
BDBM50077084
(4-{[Benzyl-(2-dimethylamino-ethyl)-amino]-phenyl-m...)
Show SMILES CCN(CC)C(=O)c1ccc(cc1)C(N(CCN(C)C)Cc1ccccc1)c1ccccc1
Show InChI InChI=1S/C29H37N3O/c1-5-31(6-2)29(33)27-19-17-26(18-20-27)28(25-15-11-8-12-16-25)32(22-21-30(3)4)23-24-13-9-7-10-14-24/h7-20,28H,5-6,21-23H2,1-4H3
Reactome pathway
n/an/a 70n/an/an/an/an/an/a
Organon Laboratories Ltd.
Curated by ChEMBL
Assay Description
Inhibition of binding of [3H]- -naltrindole (0.15 nM) to membranes from CHO cells expressing Opioid receptor delta 1
Bioorg Med Chem Lett 9: 1329-34 (1999)
BindingDB Entry DOI: 10.7270/Q2V40TCM
Mu-type opioid receptor
(Rattus norvegicus (rat))
BDBM50077084
(4-{[Benzyl-(2-dimethylamino-ethyl)-amino]-phenyl-m...)
Show SMILES CCN(CC)C(=O)c1ccc(cc1)C(N(CCN(C)C)Cc1ccccc1)c1ccccc1
Show InChI InChI=1S/C29H37N3O/c1-5-31(6-2)29(33)27-19-17-26(18-20-27)28(25-15-11-8-12-16-25)32(22-21-30(3)4)23-24-13-9-7-10-14-24/h7-20,28H,5-6,21-23H2,1-4H3
Reactome pathway
n/an/a>1.00E+4n/an/an/an/an/an/a
Organon Laboratories Ltd.
Curated by ChEMBL
Assay Description
Binding affinity towards mu opioid receptor using [3H]- -DAMGO (1.5 nM) as radioligand in rat brain membranes
Bioorg Med Chem Lett 9: 1329-34 (1999)
BindingDB Entry DOI: 10.7270/Q2V40TCM
Kappa-type opioid receptor
(Cavia porcellus (domestic guinea pig))
BDBM50077084
(4-{[Benzyl-(2-dimethylamino-ethyl)-amino]-phenyl-m...)
Show SMILES CCN(CC)C(=O)c1ccc(cc1)C(N(CCN(C)C)Cc1ccccc1)c1ccccc1
Show InChI InChI=1S/C29H37N3O/c1-5-31(6-2)29(33)27-19-17-26(18-20-27)28(25-15-11-8-12-16-25)32(22-21-30(3)4)23-24-13-9-7-10-14-24/h7-20,28H,5-6,21-23H2,1-4H3
n/an/a 483n/an/an/an/an/an/a
Organon Laboratories Ltd.
Curated by ChEMBL
Assay Description
Binding affinity towards Opioid receptor kappa 1 using [3H]- U-69,593 (1.5 nM) as radioligand in guinea pig brain membranes
Bioorg Med Chem Lett 9: 1329-34 (1999)
BindingDB Entry DOI: 10.7270/Q2V40TCM