null
SMILES: CCCC1CCNc2cc3[nH]c(=O)cc(c3cc12)C(F)(F)F
InChI Key: InChIKey=XFCZEEYKHOYYFN-UHFFFAOYSA-N
Activity Spreadsheet -- Enzyme Inhibition Constant Data from BindingDB
Found 3 hits for monomerid = 50077113
Trg + Lig
Ki
nM
ΔG°
kcal/mole
IC50
nM
Kd
nM
EC50/IC50
nM
koff
s-1
kon
M-1s-1
pHTemp
°C
Androgen receptor
(Homo sapiens (Human))
BDBM50077113
(6-Propyl-4-trifluoromethyl-6,7,8,9-tetrahydro-1H-p...)
Show SMILES CCCC1CCNc2cc3[nH]c(=O)cc(c3cc12)C(F)(F)F
Show InChI InChI=1S/C16H17F3N2O/c1-2-3-9-4-5-20-13-8-14-11(6-10(9)13)12(16(17,18)19)7-15(22)21-14/h6-9,20H,2-5H2,1H3,(H,21,22)
NCI pathway
Reactome pathway
29n/an/an/an/an/an/an/an/a
Ligand Pharmaceuticals, Inc.
Curated by ChEMBL
Assay Description
Binding affinity to the human androgen receptor (hAR), using [3H]DHT as radioligand in a competitive binding assay
Bioorg Med Chem Lett 9: 1335-40 (1999)
BindingDB Entry DOI: 10.7270/Q2JM2B4G
Androgen receptor
(Homo sapiens (Human))
BDBM50077113
(6-Propyl-4-trifluoromethyl-6,7,8,9-tetrahydro-1H-p...)
Show SMILES CCCC1CCNc2cc3[nH]c(=O)cc(c3cc12)C(F)(F)F
Show InChI InChI=1S/C16H17F3N2O/c1-2-3-9-4-5-20-13-8-14-11(6-10(9)13)12(16(17,18)19)7-15(22)21-14/h6-9,20H,2-5H2,1H3,(H,21,22)
NCI pathway
Reactome pathway
n/an/an/an/a 19n/an/an/an/a
Ligand Pharmaceuticals, Inc.
Curated by ChEMBL
Assay Description
Agonist activity to the human androgen receptor (hAR) in CV-1 cells
Bioorg Med Chem Lett 9: 1335-40 (1999)
BindingDB Entry DOI: 10.7270/Q2JM2B4G
Androgen receptor
(Homo sapiens (Human))
BDBM50077113
(6-Propyl-4-trifluoromethyl-6,7,8,9-tetrahydro-1H-p...)
Show SMILES CCCC1CCNc2cc3[nH]c(=O)cc(c3cc12)C(F)(F)F
Show InChI InChI=1S/C16H17F3N2O/c1-2-3-9-4-5-20-13-8-14-11(6-10(9)13)12(16(17,18)19)7-15(22)21-14/h6-9,20H,2-5H2,1H3,(H,21,22)
NCI pathway
Reactome pathway
n/an/a>1.00E+4n/an/an/an/an/an/a
Ligand Pharmaceuticals, Inc.
Curated by ChEMBL
Assay Description
Antagonistic activity against human androgen receptor (hAR) in CV-1 cells was determined as a function of maximal inhibition of dihydrotestosterone u...
Bioorg Med Chem Lett 9: 1335-40 (1999)
BindingDB Entry DOI: 10.7270/Q2JM2B4G