null
SMILES: CCCCCCCCc1ccc(CC[C@](N)(CO)COC)cc1
InChI Key: InChIKey=YEYZALQTJCVXIJ-FQEVSTJZSA-N
Activity Spreadsheet -- Enzyme Inhibition Constant Data from BindingDB
Found 1 hit for monomerid = 50077148
Trg + Lig
Ki
nM
ΔG°
kcal/mole
IC50
nM
Kd
nM
EC50/IC50
nM
koff
s-1
kon
M-1s-1
pHTemp
°C
Sphingosine kinase 2
(Homo sapiens (Human))
BDBM50077148
(CHEMBL3416760)
Show SMILES CCCCCCCCc1ccc(CC[C@](N)(CO)COC)cc1 |r|
Show InChI InChI=1S/C20H35NO2/c1-3-4-5-6-7-8-9-18-10-12-19(13-11-18)14-15-20(21,16-22)17-23-2/h10-13,22H,3-9,14-17,21H2,1-2H3/t20-/m0/s1
1.65E+4n/an/an/an/an/an/an/an/a
Virginia Tech
Curated by ChEMBL
Assay Description
Inhibition of human recombinant SphK2 expressed in Sf9 cells assessed as radiolabeled products using 10 uM sphingosine and 10 uM gamma[32P]ATP by liq...
J Med Chem 58: 1879-99 (2015)
Article DOI: 10.1021/jm501760d
BindingDB Entry DOI: 10.7270/Q2PK0HV3