BDBM50077548 1-{4-[3-(4-Fluoro-phenyl)-prop-2-ynyloxy]-[1,2,5]thiadiazol-3-yl}-4-aza-tricyclo[2.2.1.0*2,6*]heptane::CHEMBL294082
SMILES:
InChI Key: InChIKey=UIDKWOCFUYYLCT-UHFFFAOYSA-N
Data: 1 IC50  2 EC50
Activity Spreadsheet -- Enzyme Inhibition Constant Data from BindingDB
Found 3 hits for monomerid = 50077548
Trg + Lig
Ki
nM
ΔG°
kcal/mole
IC50
nM
Kd
nM
EC50/IC50
nM
koff
s-1
kon
M-1s-1
pHTemp
°C
Muscarinic acetylcholine receptor M1
(Homo sapiens (Human))
BDBM50077548
(1-{4-[3-(4-Fluoro-phenyl)-prop-2-ynyloxy]-[1,2,5]t...)
Show InChI InChI=1S/C17H14FN3OS/c18-12-5-3-11(4-6-12)2-1-7-22-16-15(19-23-20-16)17-10-21-8-13(17)14(17)9-21/h3-6,13-14H,7-10H2
n/an/an/an/a 71n/an/an/an/a
Novo Nordisk A/S
Curated by ChEMBL
Assay Description
Stimulation of phosphoinositol hydrolysis in the mouse fibroblast cell line A9L-M1 expressing Muscarinic acetylcholine receptor M1.
J Med Chem 42: 1999-2006 (1999)
Article DOI: 10.1021/jm9910019
BindingDB Entry DOI: 10.7270/Q2XD12BT
Muscarinic acetylcholine receptor M2
(Homo sapiens (Human))
BDBM50077548
(1-{4-[3-(4-Fluoro-phenyl)-prop-2-ynyloxy]-[1,2,5]t...)
Show InChI InChI=1S/C17H14FN3OS/c18-12-5-3-11(4-6-12)2-1-7-22-16-15(19-23-20-16)17-10-21-8-13(17)14(17)9-21/h3-6,13-14H,7-10H2
n/an/an/an/a 791n/an/an/an/a
Novo Nordisk A/S
Curated by ChEMBL
Assay Description
Compound was tested for its potency at M-2 receptor by inhibiting forskolin induced c-AMP formation in CHO-M2 cells human M2 receptor
J Med Chem 42: 1999-2006 (1999)
Article DOI: 10.1021/jm9910019
BindingDB Entry DOI: 10.7270/Q2XD12BT
Muscarinic acetylcholine receptor M2
(RAT)
BDBM50077548
(1-{4-[3-(4-Fluoro-phenyl)-prop-2-ynyloxy]-[1,2,5]t...)
Show InChI InChI=1S/C17H14FN3OS/c18-12-5-3-11(4-6-12)2-1-7-22-16-15(19-23-20-16)17-10-21-8-13(17)14(17)9-21/h3-6,13-14H,7-10H2
Reactome pathway
n/an/a 10n/an/an/an/an/an/a
Novo Nordisk A/S
Curated by ChEMBL
Assay Description
Inhibition of [3H]- Oxo-M binding at Muscarinic acetylcholine receptor M2 in rat brain membranes.
J Med Chem 42: 1999-2006 (1999)
Article DOI: 10.1021/jm9910019
BindingDB Entry DOI: 10.7270/Q2XD12BT