BDBM50077688 (3R,4R)-4-{4-[3-(2-Methoxy-benzyloxy)-propoxy]-phenyl}-3-(naphthalen-2-ylmethoxy)-piperidine::CHEMBL417485
SMILES: COc1ccccc1COCCCOc1ccc(cc1)[C@H]1CCNC[C@@H]1OCc1ccc2ccccc2c1
InChI Key: InChIKey=AZFBFLIHJUFRQE-VTIYRKAUSA-N
Data: 1 IC50
Activity Spreadsheet -- Enzyme Inhibition Constant Data from BindingDB
Found 1 hit for monomerid = 50077688
Trg + Lig
Ki
nM
ΔG°
kcal/mole
IC50
nM
Kd
nM
EC50/IC50
nM
koff
s-1
kon
M-1s-1
pHTemp
°C
Renin
(Homo sapiens (Human))
BDBM50077688
((3R,4R)-4-{4-[3-(2-Methoxy-benzyloxy)-propoxy]-phe...)
Show SMILES COc1ccccc1COCCCOc1ccc(cc1)[C@H]1CCNC[C@@H]1OCc1ccc2ccccc2c1
Show InChI InChI=1S/C33H37NO4/c1-35-32-10-5-4-9-29(32)24-36-19-6-20-37-30-15-13-27(14-16-30)31-17-18-34-22-33(31)38-23-25-11-12-26-7-2-3-8-28(26)21-25/h2-5,7-16,21,31,33-34H,6,17-20,22-24H2,1H3/t31-,33+/m1/s1
Reactome pathway
n/an/a 1.5n/an/an/an/an/an/a
F. Hoffmann-La Roche Ltd
Curated by ChEMBL
Assay Description
In vitro inhibitory activity against purified recombinant human renin
Bioorg Med Chem Lett 9: 1397-402 (1999)
BindingDB Entry DOI: 10.7270/Q24F1PWN