BDBM50077692 (3R,4R,5S)-4-[4-(3-Benzyloxy-propoxy)-phenyl]-3-(naphthalen-2-ylmethoxy)-5-[1,2,4]triazol-1-ylmethyl-piperidine::CHEMBL31881
SMILES: C(COCc1ccccc1)COc1ccc(cc1)[C@H]1[C@H](Cn2cncn2)CNC[C@@H]1OCc1ccc2ccccc2c1
InChI Key: InChIKey=ISCDJZSJGRAECW-SYRLMZQMSA-N
Data: 2 IC50
Activity Spreadsheet -- Enzyme Inhibition Constant Data from BindingDB
Found 2 hits for monomerid = 50077692
Trg + Lig
Ki
nM
ΔG°
kcal/mole
IC50
nM
Kd
nM
EC50/IC50
nM
koff
s-1
kon
M-1s-1
pHTemp
°C
Renin
(Homo sapiens (Human))
BDBM50077692
((3R,4R,5S)-4-[4-(3-Benzyloxy-propoxy)-phenyl]-3-(n...)
Show SMILES C(COCc1ccccc1)COc1ccc(cc1)[C@H]1[C@H](Cn2cncn2)CNC[C@@H]1OCc1ccc2ccccc2c1
Show InChI InChI=1S/C35H38N4O3/c1-2-7-27(8-3-1)23-40-17-6-18-41-33-15-13-30(14-16-33)35-32(22-39-26-37-25-38-39)20-36-21-34(35)42-24-28-11-12-29-9-4-5-10-31(29)19-28/h1-5,7-16,19,25-26,32,34-36H,6,17-18,20-24H2/t32-,34-,35-/m0/s1
Reactome pathway
n/an/a 0.920n/an/an/an/an/an/a
F. Hoffmann-La Roche Ltd.
Curated by ChEMBL
Assay Description
Inhibitory activity against purified recombinant human renin
Bioorg Med Chem Lett 9: 1403-8 (1999)
BindingDB Entry DOI: 10.7270/Q20P0Z6S
Renin
(Homo sapiens (Human))
BDBM50077692
((3R,4R,5S)-4-[4-(3-Benzyloxy-propoxy)-phenyl]-3-(n...)
Show SMILES C(COCc1ccccc1)COc1ccc(cc1)[C@H]1[C@H](Cn2cncn2)CNC[C@@H]1OCc1ccc2ccccc2c1
Show InChI InChI=1S/C35H38N4O3/c1-2-7-27(8-3-1)23-40-17-6-18-41-33-15-13-30(14-16-33)35-32(22-39-26-37-25-38-39)20-36-21-34(35)42-24-28-11-12-29-9-4-5-10-31(29)19-28/h1-5,7-16,19,25-26,32,34-36H,6,17-18,20-24H2/t32-,34-,35-/m0/s1
Reactome pathway
n/an/a 190n/an/an/an/an/an/a
F. Hoffmann-La Roche Ltd.
Curated by ChEMBL
Assay Description
Inhibitory activity against human plasma renin
Bioorg Med Chem Lett 9: 1403-8 (1999)
BindingDB Entry DOI: 10.7270/Q20P0Z6S