BDBM50077698 5-[(3R,4R)-3-(1,4-Dimethoxy-naphthalen-2-ylmethoxy)-piperidin-4-yl]-2-[3-(2-methoxy-benzyloxy)-propoxy]-pyrimidine::CHEMBL31404
SMILES: COc1ccccc1COCCCOc1ncc(cn1)[C@H]1CCNC[C@@H]1OCc1cc(OC)c2ccccc2c1OC
InChI Key: InChIKey=UNMOYPMWHBXSEG-NEEKEDPPSA-N
Data: 2 IC50
Activity Spreadsheet -- Enzyme Inhibition Constant Data from BindingDB
Found 2 hits for monomerid = 50077698
Trg + Lig
Ki
nM
ΔG°
kcal/mole
IC50
nM
Kd
nM
EC50/IC50
nM
koff
s-1
kon
M-1s-1
pHTemp
°C
Renin
(Homo sapiens (Human))
BDBM50077698
(5-[(3R,4R)-3-(1,4-Dimethoxy-naphthalen-2-ylmethoxy...)
Show SMILES COc1ccccc1COCCCOc1ncc(cn1)[C@H]1CCNC[C@@H]1OCc1cc(OC)c2ccccc2c1OC
Show InChI InChI=1S/C33H39N3O6/c1-37-29-12-7-4-9-23(29)21-40-15-8-16-41-33-35-18-25(19-36-33)26-13-14-34-20-31(26)42-22-24-17-30(38-2)27-10-5-6-11-28(27)32(24)39-3/h4-7,9-12,17-19,26,31,34H,8,13-16,20-22H2,1-3H3/t26-,31+/m1/s1
Reactome pathway
n/an/a 160n/an/an/an/an/an/a
F. Hoffmann-La Roche Ltd.
Curated by ChEMBL
Assay Description
Inhibitory activity against human plasma renin
Bioorg Med Chem Lett 9: 1403-8 (1999)
BindingDB Entry DOI: 10.7270/Q20P0Z6S
Renin
(Homo sapiens (Human))
BDBM50077698
(5-[(3R,4R)-3-(1,4-Dimethoxy-naphthalen-2-ylmethoxy...)
Show SMILES COc1ccccc1COCCCOc1ncc(cn1)[C@H]1CCNC[C@@H]1OCc1cc(OC)c2ccccc2c1OC
Show InChI InChI=1S/C33H39N3O6/c1-37-29-12-7-4-9-23(29)21-40-15-8-16-41-33-35-18-25(19-36-33)26-13-14-34-20-31(26)42-22-24-17-30(38-2)27-10-5-6-11-28(27)32(24)39-3/h4-7,9-12,17-19,26,31,34H,8,13-16,20-22H2,1-3H3/t26-,31+/m1/s1
Reactome pathway
n/an/a 10n/an/an/an/an/an/a
F. Hoffmann-La Roche Ltd.
Curated by ChEMBL
Assay Description
Inhibitory activity against purified recombinant human renin
Bioorg Med Chem Lett 9: 1403-8 (1999)
BindingDB Entry DOI: 10.7270/Q20P0Z6S