BDBM50077913 CHEMBL3417230
SMILES: CC(C)[C@@]1(CC[C@H](C1)NC1CC(C)c2ccccc12)C(=O)N1CCc2ccc(cc2C1)C(F)(F)F
InChI Key: InChIKey=OPSHCKPEHAHTHC-WZOLUFRESA-N
Data: 1 KI
Activity Spreadsheet -- Enzyme Inhibition Constant Data from BindingDB
Found 1 hit for monomerid = 50077913
Trg + Lig
Ki
nM
ΔG°
kcal/mole
IC50
nM
Kd
nM
EC50/IC50
nM
koff
s-1
kon
M-1s-1
pHTemp
°C
C-C chemokine receptor type 2
(Homo sapiens (Human))
BDBM50077913
(CHEMBL3417230)
Show SMILES CC(C)[C@@]1(CC[C@H](C1)NC1CC(C)c2ccccc12)C(=O)N1CCc2ccc(cc2C1)C(F)(F)F |r|
Show InChI InChI=1S/C29H35F3N2O/c1-18(2)28(12-10-23(16-28)33-26-14-19(3)24-6-4-5-7-25(24)26)27(35)34-13-11-20-8-9-22(29(30,31)32)15-21(20)17-34/h4-9,15,18-19,23,26,33H,10-14,16-17H2,1-3H3/t19?,23-,26?,28+/m1/s1
3.40n/an/an/an/an/an/an/an/a
Leiden University
Curated by ChEMBL
Assay Description
Displacement of 0.1 nM [125I]CCL2 from human CCR2 expressing human U2OS cell membrane by scintillation spectrometry
Eur J Med Chem 93: 121-34 (2015)
Article DOI: 10.1016/j.ejmech.2015.01.063
BindingDB Entry DOI: 10.7270/Q25M67DX