BDBM50077916 CHEMBL3417227
SMILES: CCOc1cncc(c1)-c1ccc2C(CCc2c1)N[C@@H]1CC[C@](C1)(C(C)C)C(=O)N1CCc2ccc(cc2C1)C(F)(F)F
InChI Key: InChIKey=IVOYYBFJNXIZQL-VJVBZRJBSA-N
Data: 1 KI
Activity Spreadsheet -- Enzyme Inhibition Constant Data from BindingDB
Found 1 hit for monomerid = 50077916
Trg + Lig
Ki
nM
ΔG°
kcal/mole
IC50
nM
Kd
nM
EC50/IC50
nM
koff
s-1
kon
M-1s-1
pHTemp
°C
C-C chemokine receptor type 2
(Homo sapiens (Human))
BDBM50077916
(CHEMBL3417227)
Show SMILES CCOc1cncc(c1)-c1ccc2C(CCc2c1)N[C@@H]1CC[C@](C1)(C(C)C)C(=O)N1CCc2ccc(cc2C1)C(F)(F)F |r|
Show InChI InChI=1S/C35H40F3N3O2/c1-4-43-30-17-26(19-39-20-30)24-6-9-31-25(15-24)7-10-32(31)40-29-11-13-34(18-29,22(2)3)33(42)41-14-12-23-5-8-28(35(36,37)38)16-27(23)21-41/h5-6,8-9,15-17,19-20,22,29,32,40H,4,7,10-14,18,21H2,1-3H3/t29-,32?,34+/m1/s1
10n/an/an/an/an/an/an/an/a
Leiden University
Curated by ChEMBL
Assay Description
Displacement of 0.1 nM [125I]CCL2 from human CCR2 expressing human U2OS cell membrane by scintillation spectrometry
Eur J Med Chem 93: 121-34 (2015)
Article DOI: 10.1016/j.ejmech.2015.01.063
BindingDB Entry DOI: 10.7270/Q25M67DX