BDBM50077981 CHEMBL3417116
SMILES: CC(C)[C@@]1(CC[C@H](C1)NC1CCc2cc(F)ccc12)C(=O)N1CCc2ccc(cc2C1)C(F)(F)F
InChI Key: InChIKey=IFPPFUMQJRCRHP-JBGVBMOJSA-N
Data: 1 KI
Activity Spreadsheet -- Enzyme Inhibition Constant Data from BindingDB
Found 1 hit for monomerid = 50077981
Trg + Lig
Ki
nM
ΔG°
kcal/mole
IC50
nM
Kd
nM
EC50/IC50
nM
koff
s-1
kon
M-1s-1
pHTemp
°C
C-C chemokine receptor type 2
(Homo sapiens (Human))
BDBM50077981
(CHEMBL3417116)
Show SMILES CC(C)[C@@]1(CC[C@H](C1)NC1CCc2cc(F)ccc12)C(=O)N1CCc2ccc(cc2C1)C(F)(F)F |r|
Show InChI InChI=1S/C28H32F4N2O/c1-17(2)27(11-9-23(15-27)33-25-8-4-19-14-22(29)6-7-24(19)25)26(35)34-12-10-18-3-5-21(28(30,31)32)13-20(18)16-34/h3,5-7,13-14,17,23,25,33H,4,8-12,15-16H2,1-2H3/t23-,25?,27+/m1/s1
4.90n/an/an/an/an/an/an/an/a
Leiden University
Curated by ChEMBL
Assay Description
Displacement of 0.1 nM [125I]CCL2 from human CCR2 expressing human U2OS cell membrane by scintillation spectrometry
Eur J Med Chem 93: 121-34 (2015)
Article DOI: 10.1016/j.ejmech.2015.01.063
BindingDB Entry DOI: 10.7270/Q25M67DX