BDBM50078003 CHEMBL3417388
SMILES: CCCC[C@H](NC(=O)[C@@H]1CCCN1C(=O)CNC(=O)[C@H](CCCCN)NC(=O)[C@H](Cc1cnc[nH]1)NC(=O)[C@H](CO)NC(=O)[C@H](CC(C)C)NC(=O)[C@H](CCCNC(N)=N)NC(=O)[C@@H]1CCCN1C(=O)[C@H](CCCNC(N)=N)NC(=O)[C@@H]1CCC(=O)N1)C(=O)N1CCC[C@H]1C(=O)N[C@@H](Cc1csc2ccccc12)C(O)=O
InChI Key:
Data: 1 KI  1 IC50  2 EC50
Activity Spreadsheet -- Enzyme Inhibition Constant Data from BindingDB
Found 4 hits for monomerid = 50078003
Trg + Lig
Ki
nM
ΔG°
kcal/mole
IC50
nM
Kd
nM
EC50/IC50
nM
koff
s-1
kon
M-1s-1
pHTemp
°C
Apelin receptor
(Homo sapiens (Human))
BDBM50078003
(CHEMBL3417388)
Show SMILES CCCC[C@H](NC(=O)[C@@H]1CCCN1C(=O)CNC(=O)[C@H](CCCCN)NC(=O)[C@H](Cc1cnc[nH]1)NC(=O)[C@H](CO)NC(=O)[C@H](CC(C)C)NC(=O)[C@H](CCCNC(N)=N)NC(=O)[C@@H]1CCCN1C(=O)[C@H](CCCNC(N)=N)NC(=O)[C@@H]1CCC(=O)N1)C(=O)N1CCC[C@H]1C(=O)N[C@@H](Cc1csc2ccccc12)C(O)=O |r|
Reactome pathway
2.20n/an/an/an/an/an/an/an/a
Universit£ de Sherbrooke
Curated by ChEMBL
Assay Description
Displacement of [125I]apelin-13[Glp65,Nle75,Tyr77] from YFP epitope-tagged human APJ receptor expressed in HEK293 cell membranes incubated for 1 hr b...
J Med Chem 58: 2431-40 (2015)
Article DOI: 10.1021/jm501916k
BindingDB Entry DOI: 10.7270/Q21V5GNR
Apelin receptor
(Homo sapiens (Human))
BDBM50078003
(CHEMBL3417388)
Show SMILES CCCC[C@H](NC(=O)[C@@H]1CCCN1C(=O)CNC(=O)[C@H](CCCCN)NC(=O)[C@H](Cc1cnc[nH]1)NC(=O)[C@H](CO)NC(=O)[C@H](CC(C)C)NC(=O)[C@H](CCCNC(N)=N)NC(=O)[C@@H]1CCCN1C(=O)[C@H](CCCNC(N)=N)NC(=O)[C@@H]1CCC(=O)N1)C(=O)N1CCC[C@H]1C(=O)N[C@@H](Cc1csc2ccccc12)C(O)=O |r|
Reactome pathway
n/an/an/an/a 1.30n/an/an/an/a
Universit£ de Sherbrooke
Curated by ChEMBL
Assay Description
Agonist activity at human APJ receptor expressed in HEK293 cells assessed as induction of Galphai1 subunit dissociation incubated for 5 mins by BRET ...
J Med Chem 58: 2431-40 (2015)
Article DOI: 10.1021/jm501916k
BindingDB Entry DOI: 10.7270/Q21V5GNR
Apelin receptor
(Homo sapiens (Human))
BDBM50078003
(CHEMBL3417388)
Show SMILES CCCC[C@H](NC(=O)[C@@H]1CCCN1C(=O)CNC(=O)[C@H](CCCCN)NC(=O)[C@H](Cc1cnc[nH]1)NC(=O)[C@H](CO)NC(=O)[C@H](CC(C)C)NC(=O)[C@H](CCCNC(N)=N)NC(=O)[C@@H]1CCCN1C(=O)[C@H](CCCNC(N)=N)NC(=O)[C@@H]1CCC(=O)N1)C(=O)N1CCC[C@H]1C(=O)N[C@@H](Cc1csc2ccccc12)C(O)=O |r|
Reactome pathway
n/an/a 2.80n/an/an/an/an/an/a
Universit£ de Sherbrooke
Curated by ChEMBL
Assay Description
Displacement of [125I]apelin-13[Glp65,Nle75,Tyr77] from YFP epitope-tagged human APJ receptor expressed in HEK293 cell membranes incubated for 1 hr b...
J Med Chem 58: 2431-40 (2015)
Article DOI: 10.1021/jm501916k
BindingDB Entry DOI: 10.7270/Q21V5GNR
Apelin receptor
(Homo sapiens (Human))
BDBM50078003
(CHEMBL3417388)
Show SMILES CCCC[C@H](NC(=O)[C@@H]1CCCN1C(=O)CNC(=O)[C@H](CCCCN)NC(=O)[C@H](Cc1cnc[nH]1)NC(=O)[C@H](CO)NC(=O)[C@H](CC(C)C)NC(=O)[C@H](CCCNC(N)=N)NC(=O)[C@@H]1CCCN1C(=O)[C@H](CCCNC(N)=N)NC(=O)[C@@H]1CCC(=O)N1)C(=O)N1CCC[C@H]1C(=O)N[C@@H](Cc1csc2ccccc12)C(O)=O |r|
Reactome pathway
n/an/an/an/a 1.30n/an/an/an/a
Universit£ de Sherbrooke
Curated by ChEMBL
Assay Description
Agonist activity at human APJ receptor expressed in HEK293 cells assessed as inhibition of forskolin-induced intracellular cAMP production incubated ...
J Med Chem 58: 2431-40 (2015)
Article DOI: 10.1021/jm501916k
BindingDB Entry DOI: 10.7270/Q21V5GNR