BDBM50078042 CHEMBL3417423
SMILES: Nc1ncc(cn1)-c1ccc(cc1)C1(CCC1)c1noc(n1)-c1c[nH]nn1
InChI Key: InChIKey=BTQYIFBOCHWFEJ-UHFFFAOYSA-N
Data: 2 IC50
Activity Spreadsheet -- Enzyme Inhibition Constant Data from BindingDB
Found 2 hits for monomerid = 50078042
Trg + Lig
Ki
nM
ΔG°
kcal/mole
IC50
nM
Kd
nM
EC50/IC50
nM
koff
s-1
kon
M-1s-1
pHTemp
°C
5-lipoxygenase/FLAP
(Homo sapiens (Human))
BDBM50078042
(CHEMBL3417423)
Show SMILES Nc1ncc(cn1)-c1ccc(cc1)C1(CCC1)c1noc(n1)-c1c[nH]nn1
Show InChI InChI=1S/C18H16N8O/c19-17-20-8-12(9-21-17)11-2-4-13(5-3-11)18(6-1-7-18)16-23-15(27-25-16)14-10-22-26-24-14/h2-5,8-10H,1,6-7H2,(H2,19,20,21)(H,22,24,26)
Reactome pathway
n/an/a 2.10E+3n/an/an/an/an/an/a
Boehringer Ingelheim Pharmaceuticals
Curated by ChEMBL
Assay Description
Inhibition of FLAP in calcimycin-stimulated human whole blood assessed as inhibition of LTB4 synthesis preincubated for 15 mins followed by calcimyci...
J Med Chem 58: 1669-90 (2015)
Article DOI: 10.1021/jm501185j
BindingDB Entry DOI: 10.7270/Q2SB47GW
5-lipoxygenase/FLAP
(Homo sapiens (Human))
BDBM50078042
(CHEMBL3417423)
Show SMILES Nc1ncc(cn1)-c1ccc(cc1)C1(CCC1)c1noc(n1)-c1c[nH]nn1
Show InChI InChI=1S/C18H16N8O/c19-17-20-8-12(9-21-17)11-2-4-13(5-3-11)18(6-1-7-18)16-23-15(27-25-16)14-10-22-26-24-14/h2-5,8-10H,1,6-7H2,(H2,19,20,21)(H,22,24,26)
Reactome pathway
n/an/a 4.70n/an/an/an/an/an/a
Boehringer Ingelheim Pharmaceuticals
Curated by ChEMBL
Assay Description
Displacement of [125I]-L-691831 from human FLAP expressed in insect SF9 cell membranes after 2 hrs by Topcount analysis
J Med Chem 58: 1669-90 (2015)
Article DOI: 10.1021/jm501185j
BindingDB Entry DOI: 10.7270/Q2SB47GW