BDBM50078059 CHEMBL3417510
SMILES: CN(C)C(=O)Cn1cc(cn1)-c1nc(no1)C1(CCC1)c1ccc(cc1)-c1cnc(N)nc1
InChI Key: InChIKey=LODLDTBDBLKVSY-UHFFFAOYSA-N
Data: 2 IC50
Activity Spreadsheet -- Enzyme Inhibition Constant Data from BindingDB
Found 2 hits for monomerid = 50078059
Trg + Lig
Ki
nM
ΔG°
kcal/mole
IC50
nM
Kd
nM
EC50/IC50
nM
koff
s-1
kon
M-1s-1
pHTemp
°C
5-lipoxygenase/FLAP
(Homo sapiens (Human))
BDBM50078059
(CHEMBL3417510)
Show SMILES CN(C)C(=O)Cn1cc(cn1)-c1nc(no1)C1(CCC1)c1ccc(cc1)-c1cnc(N)nc1
Show InChI InChI=1S/C23H24N8O2/c1-30(2)19(32)14-31-13-17(12-27-31)20-28-21(29-33-20)23(8-3-9-23)18-6-4-15(5-7-18)16-10-25-22(24)26-11-16/h4-7,10-13H,3,8-9,14H2,1-2H3,(H2,24,25,26)
Reactome pathway
n/an/a 3.60n/an/an/an/an/an/a
Boehringer Ingelheim Pharmaceuticals
Curated by ChEMBL
Assay Description
Displacement of [125I]-L-691831 from human FLAP expressed in insect SF9 cell membranes after 2 hrs by Topcount analysis
J Med Chem 58: 1669-90 (2015)
Article DOI: 10.1021/jm501185j
BindingDB Entry DOI: 10.7270/Q2SB47GW
5-lipoxygenase/FLAP
(Homo sapiens (Human))
BDBM50078059
(CHEMBL3417510)
Show SMILES CN(C)C(=O)Cn1cc(cn1)-c1nc(no1)C1(CCC1)c1ccc(cc1)-c1cnc(N)nc1
Show InChI InChI=1S/C23H24N8O2/c1-30(2)19(32)14-31-13-17(12-27-31)20-28-21(29-33-20)23(8-3-9-23)18-6-4-15(5-7-18)16-10-25-22(24)26-11-16/h4-7,10-13H,3,8-9,14H2,1-2H3,(H2,24,25,26)
Reactome pathway
n/an/a 81n/an/an/an/an/an/a
Boehringer Ingelheim Pharmaceuticals
Curated by ChEMBL
Assay Description
Inhibition of FLAP in calcimycin-stimulated human whole blood assessed as inhibition of LTB4 synthesis preincubated for 15 mins followed by calcimyci...
J Med Chem 58: 1669-90 (2015)
Article DOI: 10.1021/jm501185j
BindingDB Entry DOI: 10.7270/Q2SB47GW