BDBM50078072 (S)-4-(4-(2-amino-6-methyl-4-oxo-4,7-dihydro-3H-pyrrolo[2,3-d]pyrimidin-5-ylthio)benzamido)-5-oxopentanoic acid::2-[4-(2-Amino-6-methyl-4-oxo-4,7-dihydro-3H-pyrrolo[2,3-d]pyrimidin-5-ylsulfanyl)-benzoylamino]-pentanedioic acid::CHEMBL306149
SMILES: Cc1[nH]c2nc(N)[nH]c(=O)c2c1Sc1ccc(cc1)C(=O)NC(CCC(O)=O)C(O)=O
InChI Key: InChIKey=DSIACOJIIGFHHZ-UHFFFAOYSA-N
Data: 2 IC50
Activity Spreadsheet -- Enzyme Inhibition Constant Data from BindingDB
Found 2 hits for monomerid = 50078072
Trg + Lig
Ki
nM
ΔG°
kcal/mole
IC50
nM
Kd
nM
EC50/IC50
nM
koff
s-1
kon
M-1s-1
pHTemp
°C
Thymidylate synthase
(Homo sapiens (Human))
BDBM50078072
((S)-4-(4-(2-amino-6-methyl-4-oxo-4,7-dihydro-3H-py...)
Show SMILES Cc1[nH]c2nc(N)[nH]c(=O)c2c1Sc1ccc(cc1)C(=O)NC(CCC(O)=O)C(O)=O
Show InChI InChI=1S/C19H19N5O6S/c1-8-14(13-15(21-8)23-19(20)24-17(13)28)31-10-4-2-9(3-5-10)16(27)22-11(18(29)30)6-7-12(25)26/h2-5,11H,6-7H2,1H3,(H,22,27)(H,25,26)(H,29,30)(H4,20,21,23,24,28)
NCI pathway
Reactome pathway
n/an/a 42n/an/an/an/an/an/a
Duquesne University
Curated by ChEMBL
Assay Description
Compound was evaluated for the inhibition at a given concentration against recombinant human Thymidylate synthase
J Med Chem 42: 2272-9 (1999)
Article DOI: 10.1021/jm980586o
BindingDB Entry DOI: 10.7270/Q29Z9421
Thymidylate synthase
(Homo sapiens (Human))
BDBM50078072
((S)-4-(4-(2-amino-6-methyl-4-oxo-4,7-dihydro-3H-py...)
Show SMILES Cc1[nH]c2nc(N)[nH]c(=O)c2c1Sc1ccc(cc1)C(=O)NC(CCC(O)=O)C(O)=O
Show InChI InChI=1S/C19H19N5O6S/c1-8-14(13-15(21-8)23-19(20)24-17(13)28)31-10-4-2-9(3-5-10)16(27)22-11(18(29)30)6-7-12(25)26/h2-5,11H,6-7H2,1H3,(H,22,27)(H,25,26)(H,29,30)(H4,20,21,23,24,28)
NCI pathway
Reactome pathway
n/an/a 21n/an/an/an/an/an/a
Duquesne University
Curated by ChEMBL
Assay Description
Compound was evaluated for the inhibition at a given concentration against Lactobacillus casei Thymidylate synthase
J Med Chem 42: 2272-9 (1999)
Article DOI: 10.1021/jm980586o
BindingDB Entry DOI: 10.7270/Q29Z9421