BDBM50078218 CHEMBL3414677
SMILES: CC(C)CCCC1(C)CCc2cc(O)cc(c2O1)C(F)(F)F
InChI Key: InChIKey=SPSZBLCBGPAEFU-UHFFFAOYSA-N
Data: 1 Kd
Activity Spreadsheet -- Enzyme Inhibition Constant Data from BindingDB
Found 1 hit for monomerid = 50078218
Trg + Lig
Ki
nM
ΔG°
kcal/mole
IC50
nM
Kd
nM
EC50/IC50
nM
koff
s-1
kon
M-1s-1
pHTemp
°C
RAC-alpha serine/threonine-protein kinase
(Homo sapiens (Human))
BDBM50078218
(CHEMBL3414677)
Show SMILES CC(C)CCCC1(C)CCc2cc(O)cc(c2O1)C(F)(F)F
Show InChI InChI=1S/C17H23F3O2/c1-11(2)5-4-7-16(3)8-6-12-9-13(21)10-14(15(12)22-16)17(18,19)20/h9-11,21H,4-8H2,1-3H3
n/an/an/a 450n/an/an/an/an/a
The Ohio State University
Curated by ChEMBL
Assay Description
Binding affinity to GST-tagged PH domain of AKT (unknown origin) by surface Plasmon resonance spectroscopy
J Med Chem 58: 2290-8 (2015)
Article DOI: 10.1021/jm501751b
BindingDB Entry DOI: 10.7270/Q20V8FGX