BDBM50078223 CHEMBL3414672
SMILES: CC(C)CCCC1(C)CCc2cc(O)cc(C)c2O1
InChI Key: InChIKey=RRRVKRHLTVWNMO-UHFFFAOYSA-N
Data: 1 Kd
Activity Spreadsheet -- Enzyme Inhibition Constant Data from BindingDB
Found 1 hit for monomerid = 50078223
Trg + Lig
Ki
nM
ΔG°
kcal/mole
IC50
nM
Kd
nM
EC50/IC50
nM
koff
s-1
kon
M-1s-1
pHTemp
°C
RAC-alpha serine/threonine-protein kinase
(Homo sapiens (Human))
BDBM50078223
(CHEMBL3414672)
Show SMILES CC(C)CCCC1(C)CCc2cc(O)cc(C)c2O1
Show InChI InChI=1S/C17H26O2/c1-12(2)6-5-8-17(4)9-7-14-11-15(18)10-13(3)16(14)19-17/h10-12,18H,5-9H2,1-4H3
n/an/an/a 410n/an/an/an/an/a
The Ohio State University
Curated by ChEMBL
Assay Description
Binding affinity to GST-tagged PH domain of AKT (unknown origin) by surface Plasmon resonance spectroscopy
J Med Chem 58: 2290-8 (2015)
Article DOI: 10.1021/jm501751b
BindingDB Entry DOI: 10.7270/Q20V8FGX