BDBM50078321 CHEMBL3414711::US9260455, 7
SMILES: [H][C@]12CSC(N)=N[C@]1(CO[C@@H](CC(C)C)C2)c1ccc(F)cc1F
InChI Key: InChIKey=KSUADMBOPPDFIC-BNLOLNQZSA-N
Data: 4 IC50
Activity Spreadsheet -- Enzyme Inhibition Constant Data from BindingDB
Found 4 hits for monomerid = 50078321
Trg + Lig
Ki
nM
ΔG°
kcal/mole
IC50
nM
Kd
nM
EC50/IC50
nM
koff
s-1
kon
M-1s-1
pHTemp
°C
Beta-secretase 1 (BACE1)
(Homo sapiens (Human))
BDBM50078321
(CHEMBL3414711 | US9260455, 7)
Show SMILES [H][C@]12CSC(N)=N[C@]1(CO[C@@H](CC(C)C)C2)c1ccc(F)cc1F |r,c:5|
Show InChI InChI=1S/C17H22F2N2OS/c1-10(2)5-13-6-11-8-23-16(20)21-17(11,9-22-13)14-4-3-12(18)7-15(14)19/h3-4,7,10-11,13H,5-6,8-9H2,1-2H3,(H2,20,21)/t11-,13-,17-/m0/s1
US Patent
n/an/a 118n/an/an/an/a4.537
Pfizer Inc.
US Patent
Assay Description
A synthetic APP substrate that can be cleaved by beta-secretase having N-terminal biotin and made fluorescent by the covalent attachment of Oregon Gr...
US Patent US9260455 (2016)
BindingDB Entry DOI: 10.7270/Q2GB22WN
Beta-secretase 1
(Homo sapiens (Human))
BDBM50078321
(CHEMBL3414711 | US9260455, 7)
Show SMILES [H][C@]12CSC(N)=N[C@]1(CO[C@@H](CC(C)C)C2)c1ccc(F)cc1F |r,c:5|
Show InChI InChI=1S/C17H22F2N2OS/c1-10(2)5-13-6-11-8-23-16(20)21-17(11,9-22-13)14-4-3-12(18)7-15(14)19/h3-4,7,10-11,13H,5-6,8-9H2,1-2H3,(H2,20,21)/t11-,13-,17-/m0/s1
n/an/a 150n/an/an/an/an/an/a
Eurofarma Laboratorios S.A.
Curated by ChEMBL
Assay Description
Inhibition of BACE1 (unknown origin) using biotin-GLTNIKTEEISEISYEVEFR-C[Oregon Green]KK-OH as substrate after 3 hrs by fluorescence polarization ass...
J Med Chem 58: 2678-702 (2015)
Article DOI: 10.1021/jm501833t
BindingDB Entry DOI: 10.7270/Q2W37Z1D
Cathepsin D
(Homo sapiens (Human))
BDBM50078321
(CHEMBL3414711 | US9260455, 7)
Show SMILES [H][C@]12CSC(N)=N[C@]1(CO[C@@H](CC(C)C)C2)c1ccc(F)cc1F |r,c:5|
Show InChI InChI=1S/C17H22F2N2OS/c1-10(2)5-13-6-11-8-23-16(20)21-17(11,9-22-13)14-4-3-12(18)7-15(14)19/h3-4,7,10-11,13H,5-6,8-9H2,1-2H3,(H2,20,21)/t11-,13-,17-/m0/s1
NCI pathway
Reactome pathway
n/an/a 2.51E+4n/an/an/an/an/an/a
Eurofarma Laboratorios S.A.
Curated by ChEMBL
Assay Description
Inhibition of CatD (unknown origin) by fluorescence polarization assay
J Med Chem 58: 2678-702 (2015)
Article DOI: 10.1021/jm501833t
BindingDB Entry DOI: 10.7270/Q2W37Z1D
Beta-secretase 1
(Homo sapiens (Human))
BDBM50078321
(CHEMBL3414711 | US9260455, 7)
Show SMILES [H][C@]12CSC(N)=N[C@]1(CO[C@@H](CC(C)C)C2)c1ccc(F)cc1F |r,c:5|
Show InChI InChI=1S/C17H22F2N2OS/c1-10(2)5-13-6-11-8-23-16(20)21-17(11,9-22-13)14-4-3-12(18)7-15(14)19/h3-4,7,10-11,13H,5-6,8-9H2,1-2H3,(H2,20,21)/t11-,13-,17-/m0/s1
n/an/a 25n/an/an/an/an/an/a
Eurofarma Laboratorios S.A.
Curated by ChEMBL
Assay Description
Inhibition of BACE1 in human H4 cells overexpressing APP695 assessed as sAPPbeta level after 18 hrs by ELISA
J Med Chem 58: 2678-702 (2015)
Article DOI: 10.1021/jm501833t
BindingDB Entry DOI: 10.7270/Q2W37Z1D