BDBM50078354 CHEMBL3414727
SMILES: [H][C@@]12CN(C(=O)[C@@H](NC(=O)[C@H](C)NC)C3CCCCC3)[C@@]([H])(C1)C(=O)N[C@@H](Cc1ccc3ccccc3c1)C(=O)N[C@@H](Cc1ccc(OCc3cn(nn3)[C@]3([H])CN(C(=O)[C@@H](NC(=O)[C@H](C)NC)C4CCCCC4)[C@@]([H])(C3)C(=O)N[C@@H](Cc3ccc4ccccc4c3)C(=O)N[C@@H](Cc3ccc(OCc4cn2nn4)cc3)C(O)=O)cc1)C(O)=O
InChI Key: InChIKey=HZGOIKMHTUCXAI-KWEJKZBISA-N
Data: 4 IC50  1 EC50
Activity Spreadsheet -- Enzyme Inhibition Constant Data from BindingDB
Found 5 hits for monomerid = 50078354
Trg + Lig
Ki
nM
ΔG°
kcal/mole
IC50
nM
Kd
nM
EC50/IC50
nM
koff
s-1
kon
M-1s-1
pHTemp
°C
Baculoviral IAP repeat-containing protein 3 (IAP1 BIR3)
(Homo sapiens (Human))
BDBM50078354
(CHEMBL3414727)
Show SMILES [H][C@@]12CN(C(=O)[C@@H](NC(=O)[C@H](C)NC)C3CCCCC3)[C@@]([H])(C1)C(=O)N[C@@H](Cc1ccc3ccccc3c1)C(=O)N[C@@H](Cc1ccc(OCc3cn(nn3)[C@]3([H])CN(C(=O)[C@@H](NC(=O)[C@H](C)NC)C4CCCCC4)[C@@]([H])(C3)C(=O)N[C@@H](Cc3ccc4ccccc4c3)C(=O)N[C@@H](Cc3ccc(OCc4cn2nn4)cc3)C(O)=O)cc1)C(O)=O |r|
Show InChI InChI=1S/C84H100N16O14/c1-49(85-3)75(101)91-73(57-17-7-5-8-18-57)81(107)97-45-63-41-71(97)79(105)87-67(39-53-23-29-55-15-11-13-21-59(55)35-53)77(103)89-69(83(109)110)37-51-27-33-66(34-28-51)114-48-62-44-100(96-94-62)64-42-72(98(46-64)82(108)74(58-19-9-6-10-20-58)92-76(102)50(2)86-4)80(106)88-68(40-54-24-30-56-16-12-14-22-60(56)36-54)78(104)90-70(84(111)112)38-52-25-31-65(32-26-52)113-47-61-43-99(63)95-93-61/h11-16,21-36,43-44,49-50,57-58,63-64,67-74,85-86H,5-10,17-20,37-42,45-48H2,1-4H3,(H,87,105)(H,88,106)(H,89,103)(H,90,104)(H,91,101)(H,92,102)(H,109,110)(H,111,112)/t49-,50-,63-,64-,67-,68-,69-,70-,71-,72-,73-,74-/m0/s1
n/an/a 24n/an/an/an/an/an/a
Ensemble Therapeutics Corp
Curated by ChEMBL
Assay Description
Inhibition of cIAP1 BIR3 (154 to 352 residues) (unknown origin) by fluoresceinated dimeric SMAC peptide based fluorescence polarization assay
J Med Chem 58: 2855-61 (2015)
Article DOI: 10.1021/jm501892g
BindingDB Entry DOI: 10.7270/Q2RF5WQ0
Baculoviral IAP repeat-containing protein 3 (IAP1 BIR3)
(Homo sapiens (Human))
BDBM50078354
(CHEMBL3414727)
Show SMILES [H][C@@]12CN(C(=O)[C@@H](NC(=O)[C@H](C)NC)C3CCCCC3)[C@@]([H])(C1)C(=O)N[C@@H](Cc1ccc3ccccc3c1)C(=O)N[C@@H](Cc1ccc(OCc3cn(nn3)[C@]3([H])CN(C(=O)[C@@H](NC(=O)[C@H](C)NC)C4CCCCC4)[C@@]([H])(C3)C(=O)N[C@@H](Cc3ccc4ccccc4c3)C(=O)N[C@@H](Cc3ccc(OCc4cn2nn4)cc3)C(O)=O)cc1)C(O)=O |r|
Show InChI InChI=1S/C84H100N16O14/c1-49(85-3)75(101)91-73(57-17-7-5-8-18-57)81(107)97-45-63-41-71(97)79(105)87-67(39-53-23-29-55-15-11-13-21-59(55)35-53)77(103)89-69(83(109)110)37-51-27-33-66(34-28-51)114-48-62-44-100(96-94-62)64-42-72(98(46-64)82(108)74(58-19-9-6-10-20-58)92-76(102)50(2)86-4)80(106)88-68(40-54-24-30-56-16-12-14-22-60(56)36-54)78(104)90-70(84(111)112)38-52-25-31-65(32-26-52)113-47-61-43-99(63)95-93-61/h11-16,21-36,43-44,49-50,57-58,63-64,67-74,85-86H,5-10,17-20,37-42,45-48H2,1-4H3,(H,87,105)(H,88,106)(H,89,103)(H,90,104)(H,91,101)(H,92,102)(H,109,110)(H,111,112)/t49-,50-,63-,64-,67-,68-,69-,70-,71-,72-,73-,74-/m0/s1
n/an/a 54n/an/an/an/an/an/a
Ensemble Therapeutics Corp
Curated by ChEMBL
Assay Description
Inhibition of XIAP BIR3 (241 to 356 residues) (unknown origin) incubated for 60 mins by fluoresceinated modified SMAC peptide based fluorescence pola...
J Med Chem 58: 2855-61 (2015)
Article DOI: 10.1021/jm501892g
BindingDB Entry DOI: 10.7270/Q2RF5WQ0
Baculoviral IAP repeat-containing protein 2
(Homo sapiens (Human))
BDBM50078354
(CHEMBL3414727)
Show SMILES [H][C@@]12CN(C(=O)[C@@H](NC(=O)[C@H](C)NC)C3CCCCC3)[C@@]([H])(C1)C(=O)N[C@@H](Cc1ccc3ccccc3c1)C(=O)N[C@@H](Cc1ccc(OCc3cn(nn3)[C@]3([H])CN(C(=O)[C@@H](NC(=O)[C@H](C)NC)C4CCCCC4)[C@@]([H])(C3)C(=O)N[C@@H](Cc3ccc4ccccc4c3)C(=O)N[C@@H](Cc3ccc(OCc4cn2nn4)cc3)C(O)=O)cc1)C(O)=O |r|
Show InChI InChI=1S/C84H100N16O14/c1-49(85-3)75(101)91-73(57-17-7-5-8-18-57)81(107)97-45-63-41-71(97)79(105)87-67(39-53-23-29-55-15-11-13-21-59(55)35-53)77(103)89-69(83(109)110)37-51-27-33-66(34-28-51)114-48-62-44-100(96-94-62)64-42-72(98(46-64)82(108)74(58-19-9-6-10-20-58)92-76(102)50(2)86-4)80(106)88-68(40-54-24-30-56-16-12-14-22-60(56)36-54)78(104)90-70(84(111)112)38-52-25-31-65(32-26-52)113-47-61-43-99(63)95-93-61/h11-16,21-36,43-44,49-50,57-58,63-64,67-74,85-86H,5-10,17-20,37-42,45-48H2,1-4H3,(H,87,105)(H,88,106)(H,89,103)(H,90,104)(H,91,101)(H,92,102)(H,109,110)(H,111,112)/t49-,50-,63-,64-,67-,68-,69-,70-,71-,72-,73-,74-/m0/s1
n/an/an/an/a 54n/an/an/an/a
Ensemble Therapeutics Corp
Curated by ChEMBL
Assay Description
Inhibition of XIAP BIR2-3 (124 to 356 residues) C202A/C213G mutant (unknown origin) in human THP1 cells using fluoresceinated caspase-3 substrate by ...
J Med Chem 58: 2855-61 (2015)
Article DOI: 10.1021/jm501892g
BindingDB Entry DOI: 10.7270/Q2RF5WQ0
Baculoviral IAP repeat-containing protein 2
(Homo sapiens (Human))
BDBM50078354
(CHEMBL3414727)
Show SMILES [H][C@@]12CN(C(=O)[C@@H](NC(=O)[C@H](C)NC)C3CCCCC3)[C@@]([H])(C1)C(=O)N[C@@H](Cc1ccc3ccccc3c1)C(=O)N[C@@H](Cc1ccc(OCc3cn(nn3)[C@]3([H])CN(C(=O)[C@@H](NC(=O)[C@H](C)NC)C4CCCCC4)[C@@]([H])(C3)C(=O)N[C@@H](Cc3ccc4ccccc4c3)C(=O)N[C@@H](Cc3ccc(OCc4cn2nn4)cc3)C(O)=O)cc1)C(O)=O |r|
Show InChI InChI=1S/C84H100N16O14/c1-49(85-3)75(101)91-73(57-17-7-5-8-18-57)81(107)97-45-63-41-71(97)79(105)87-67(39-53-23-29-55-15-11-13-21-59(55)35-53)77(103)89-69(83(109)110)37-51-27-33-66(34-28-51)114-48-62-44-100(96-94-62)64-42-72(98(46-64)82(108)74(58-19-9-6-10-20-58)92-76(102)50(2)86-4)80(106)88-68(40-54-24-30-56-16-12-14-22-60(56)36-54)78(104)90-70(84(111)112)38-52-25-31-65(32-26-52)113-47-61-43-99(63)95-93-61/h11-16,21-36,43-44,49-50,57-58,63-64,67-74,85-86H,5-10,17-20,37-42,45-48H2,1-4H3,(H,87,105)(H,88,106)(H,89,103)(H,90,104)(H,91,101)(H,92,102)(H,109,110)(H,111,112)/t49-,50-,63-,64-,67-,68-,69-,70-,71-,72-,73-,74-/m0/s1
n/an/a 24n/an/an/an/an/an/a
Ensemble Therapeutics Corp
Curated by ChEMBL
Assay Description
Inhibition of XIAP BIR2-3 (125 to 356 residues) C202A/C213G mutant (unknown origin) fluoresceinated dimeric SMAC peptide based fluorescence polarizat...
J Med Chem 58: 2855-61 (2015)
Article DOI: 10.1021/jm501892g
BindingDB Entry DOI: 10.7270/Q2RF5WQ0
Baculoviral IAP repeat-containing protein 2
(Homo sapiens (Human))
BDBM50078354
(CHEMBL3414727)
Show SMILES [H][C@@]12CN(C(=O)[C@@H](NC(=O)[C@H](C)NC)C3CCCCC3)[C@@]([H])(C1)C(=O)N[C@@H](Cc1ccc3ccccc3c1)C(=O)N[C@@H](Cc1ccc(OCc3cn(nn3)[C@]3([H])CN(C(=O)[C@@H](NC(=O)[C@H](C)NC)C4CCCCC4)[C@@]([H])(C3)C(=O)N[C@@H](Cc3ccc4ccccc4c3)C(=O)N[C@@H](Cc3ccc(OCc4cn2nn4)cc3)C(O)=O)cc1)C(O)=O |r|
Show InChI InChI=1S/C84H100N16O14/c1-49(85-3)75(101)91-73(57-17-7-5-8-18-57)81(107)97-45-63-41-71(97)79(105)87-67(39-53-23-29-55-15-11-13-21-59(55)35-53)77(103)89-69(83(109)110)37-51-27-33-66(34-28-51)114-48-62-44-100(96-94-62)64-42-72(98(46-64)82(108)74(58-19-9-6-10-20-58)92-76(102)50(2)86-4)80(106)88-68(40-54-24-30-56-16-12-14-22-60(56)36-54)78(104)90-70(84(111)112)38-52-25-31-65(32-26-52)113-47-61-43-99(63)95-93-61/h11-16,21-36,43-44,49-50,57-58,63-64,67-74,85-86H,5-10,17-20,37-42,45-48H2,1-4H3,(H,87,105)(H,88,106)(H,89,103)(H,90,104)(H,91,101)(H,92,102)(H,109,110)(H,111,112)/t49-,50-,63-,64-,67-,68-,69-,70-,71-,72-,73-,74-/m0/s1
n/an/a 7n/an/an/an/an/an/a
Ensemble Therapeutics Corp
Curated by ChEMBL
Assay Description
Inhibition of cIAP1 BIR2-3 (154 to 352 residues) (unknown origin) fluoresceinated dimeric SMAC peptide based fluorescence polarization assay
J Med Chem 58: 2855-61 (2015)
Article DOI: 10.1021/jm501892g
BindingDB Entry DOI: 10.7270/Q2RF5WQ0