BDBM50078392 (S)-1-((2R,3R)-3-Amino-2-hydroxy-5-methyl-hexanoyl)-pyrrolidine-2-carboxylic acid ((S)-1-carbamoyl-ethyl)-amide::CHEMBL81423
SMILES: CC(C)C[C@@H](N)[C@@H](O)C(=O)N1CCC[C@H]1C(=O)N[C@@H](C)C(N)=O
InChI Key: InChIKey=PDGQBIYMLALKTR-WHOHXGKFSA-N
Data: 7 IC50
Activity Spreadsheet -- Enzyme Inhibition Constant Data from BindingDB
Found 7 hits for monomerid = 50078392
Trg + Lig
Ki
nM
ΔG°
kcal/mole
IC50
nM
Kd
nM
EC50/IC50
nM
koff
s-1
kon
M-1s-1
pHTemp
°C
Xaa-Pro aminopeptidase 1
(Homo sapiens (Human))
BDBM50078392
((S)-1-((2R,3R)-3-Amino-2-hydroxy-5-methyl-hexanoyl...)
Show SMILES CC(C)C[C@@H](N)[C@@H](O)C(=O)N1CCC[C@H]1C(=O)N[C@@H](C)C(N)=O
Show InChI InChI=1S/C15H28N4O4/c1-8(2)7-10(16)12(20)15(23)19-6-4-5-11(19)14(22)18-9(3)13(17)21/h8-12,20H,4-7,16H2,1-3H3,(H2,17,21)(H,18,22)/t9-,10+,11-,12+/m0/s1
n/an/a>1.50E+6n/an/an/an/an/an/a
Pharmacia and Upjohn
Curated by ChEMBL
Assay Description
Inhibition against Aminopeptidase P from human platelets.
J Med Chem 42: 2394-402 (1999)
Article DOI: 10.1021/jm9805642
BindingDB Entry DOI: 10.7270/Q2N878ZS
Xaa-Pro aminopeptidase 1
(Homo sapiens (Human))
BDBM50078392
((S)-1-((2R,3R)-3-Amino-2-hydroxy-5-methyl-hexanoyl...)
Show SMILES CC(C)C[C@@H](N)[C@@H](O)C(=O)N1CCC[C@H]1C(=O)N[C@@H](C)C(N)=O
Show InChI InChI=1S/C15H28N4O4/c1-8(2)7-10(16)12(20)15(23)19-6-4-5-11(19)14(22)18-9(3)13(17)21/h8-12,20H,4-7,16H2,1-3H3,(H2,17,21)(H,18,22)/t9-,10+,11-,12+/m0/s1
n/an/a>1.50E+6n/an/an/an/an/an/a
Pharmacia and Upjohn
Curated by ChEMBL
Assay Description
Inhibition against cytosolic Aminopeptidase P from human heart.
J Med Chem 42: 2394-402 (1999)
Article DOI: 10.1021/jm9805642
BindingDB Entry DOI: 10.7270/Q2N878ZS
Membrane-bound aminopeptidase P (APP2)
(Homo sapiens (Human))
BDBM50078392
((S)-1-((2R,3R)-3-Amino-2-hydroxy-5-methyl-hexanoyl...)
Show SMILES CC(C)C[C@@H](N)[C@@H](O)C(=O)N1CCC[C@H]1C(=O)N[C@@H](C)C(N)=O
Show InChI InChI=1S/C15H28N4O4/c1-8(2)7-10(16)12(20)15(23)19-6-4-5-11(19)14(22)18-9(3)13(17)21/h8-12,20H,4-7,16H2,1-3H3,(H2,17,21)(H,18,22)/t9-,10+,11-,12+/m0/s1
n/an/a 3.10E+4n/an/an/an/an/an/a
Pharmacia and Upjohn
Curated by ChEMBL
Assay Description
Inhibition against membrane bound human aminopeptidase P
J Med Chem 42: 2394-402 (1999)
Article DOI: 10.1021/jm9805642
BindingDB Entry DOI: 10.7270/Q2N878ZS
Membrane-bound aminopeptidase P (APP2)
(Homo sapiens (Human))
BDBM50078392
((S)-1-((2R,3R)-3-Amino-2-hydroxy-5-methyl-hexanoyl...)
Show SMILES CC(C)C[C@@H](N)[C@@H](O)C(=O)N1CCC[C@H]1C(=O)N[C@@H](C)C(N)=O
Show InChI InChI=1S/C15H28N4O4/c1-8(2)7-10(16)12(20)15(23)19-6-4-5-11(19)14(22)18-9(3)13(17)21/h8-12,20H,4-7,16H2,1-3H3,(H2,17,21)(H,18,22)/t9-,10+,11-,12+/m0/s1
n/an/a 3.00E+4n/an/an/an/an/an/a
Pharmacia and Upjohn
Curated by ChEMBL
Assay Description
Inhibition against membrane bound monkey aminopeptidase P
J Med Chem 42: 2394-402 (1999)
Article DOI: 10.1021/jm9805642
BindingDB Entry DOI: 10.7270/Q2N878ZS
Xaa-Pro aminopeptidase 2
(Rattus norvegicus)
BDBM50078392
((S)-1-((2R,3R)-3-Amino-2-hydroxy-5-methyl-hexanoyl...)
Show SMILES CC(C)C[C@@H](N)[C@@H](O)C(=O)N1CCC[C@H]1C(=O)N[C@@H](C)C(N)=O
Show InChI InChI=1S/C15H28N4O4/c1-8(2)7-10(16)12(20)15(23)19-6-4-5-11(19)14(22)18-9(3)13(17)21/h8-12,20H,4-7,16H2,1-3H3,(H2,17,21)(H,18,22)/t9-,10+,11-,12+/m0/s1
n/an/a 1.90E+4n/an/an/an/an/an/a
Pharmacia and Upjohn
Curated by ChEMBL
Assay Description
Activity against membrane bound rat aminopeptidase P
J Med Chem 42: 2394-402 (1999)
Article DOI: 10.1021/jm9805642
BindingDB Entry DOI: 10.7270/Q2N878ZS
Xaa-Pro dipeptidase
(Homo sapiens (Human))
BDBM50078392
((S)-1-((2R,3R)-3-Amino-2-hydroxy-5-methyl-hexanoyl...)
Show SMILES CC(C)C[C@@H](N)[C@@H](O)C(=O)N1CCC[C@H]1C(=O)N[C@@H](C)C(N)=O
Show InChI InChI=1S/C15H28N4O4/c1-8(2)7-10(16)12(20)15(23)19-6-4-5-11(19)14(22)18-9(3)13(17)21/h8-12,20H,4-7,16H2,1-3H3,(H2,17,21)(H,18,22)/t9-,10+,11-,12+/m0/s1
n/an/a 4.10E+5n/an/an/an/an/an/a
Pharmacia and Upjohn
Curated by ChEMBL
Assay Description
Inhibition against Prolidase from pig kidney.
J Med Chem 42: 2394-402 (1999)
Article DOI: 10.1021/jm9805642
BindingDB Entry DOI: 10.7270/Q2N878ZS
Leucine aminopeptidase
(Homo sapiens (Human))
BDBM50078392
((S)-1-((2R,3R)-3-Amino-2-hydroxy-5-methyl-hexanoyl...)
Show SMILES CC(C)C[C@@H](N)[C@@H](O)C(=O)N1CCC[C@H]1C(=O)N[C@@H](C)C(N)=O
Show InChI InChI=1S/C15H28N4O4/c1-8(2)7-10(16)12(20)15(23)19-6-4-5-11(19)14(22)18-9(3)13(17)21/h8-12,20H,4-7,16H2,1-3H3,(H2,17,21)(H,18,22)/t9-,10+,11-,12+/m0/s1
n/an/a>1.00E+6n/an/an/an/an/an/a
Pharmacia and Upjohn
Curated by ChEMBL
Assay Description
Inhibition against Leucyl aminopeptidase from pig kidney.
J Med Chem 42: 2394-402 (1999)
Article DOI: 10.1021/jm9805642
BindingDB Entry DOI: 10.7270/Q2N878ZS