BDBM50078438 (S)-3-{[5-(2-Piperidin-4-yl-ethyl)-thieno[3,2-b]thiophene-2-carbonyl]-amino}-2-(thiophene-2-sulfonylamino)-propionic acid::CHEMBL78517
SMILES: OC(=O)[C@H](CNC(=O)c1cc2sc(CCC3CCNCC3)cc2s1)NS(=O)(=O)c1cccs1
InChI Key: InChIKey=WVUZBVPGGBTRTK-HNNXBMFYSA-N
Data: 1 IC50  1 Kd
Activity Spreadsheet -- Enzyme Inhibition Constant Data from BindingDB
Found 2 hits for monomerid = 50078438
Trg + Lig
Ki
nM
ΔG°
kcal/mole
IC50
nM
Kd
nM
EC50/IC50
nM
koff
s-1
kon
M-1s-1
pHTemp
°C
Integrin alpha-IIb/beta-3
(Homo sapiens (Human))
BDBM50078438
((S)-3-{[5-(2-Piperidin-4-yl-ethyl)-thieno[3,2-b]th...)
Show SMILES OC(=O)[C@H](CNC(=O)c1cc2sc(CCC3CCNCC3)cc2s1)NS(=O)(=O)c1cccs1
Show InChI InChI=1S/C21H25N3O5S4/c25-20(23-12-15(21(26)27)24-33(28,29)19-2-1-9-30-19)18-11-17-16(32-18)10-14(31-17)4-3-13-5-7-22-8-6-13/h1-2,9-11,13,15,22,24H,3-8,12H2,(H,23,25)(H,26,27)/t15-/m0/s1
n/an/a 13n/an/an/an/an/an/a
Merck Research Laboratories
Curated by ChEMBL
Assay Description
The compound was tested in vivo for the inhibition of aggregation of human gel-filtered platelets(GFP)
J Med Chem 42: 2409-21 (1999)
Article DOI: 10.1021/jm980722p
BindingDB Entry DOI: 10.7270/Q2HH6J8X
Integrin alpha-IIb/beta-3
(Homo sapiens (Human))
BDBM50078438
((S)-3-{[5-(2-Piperidin-4-yl-ethyl)-thieno[3,2-b]th...)
Show SMILES OC(=O)[C@H](CNC(=O)c1cc2sc(CCC3CCNCC3)cc2s1)NS(=O)(=O)c1cccs1
Show InChI InChI=1S/C21H25N3O5S4/c25-20(23-12-15(21(26)27)24-33(28,29)19-2-1-9-30-19)18-11-17-16(32-18)10-14(31-17)4-3-13-5-7-22-8-6-13/h1-2,9-11,13,15,22,24H,3-8,12H2,(H,23,25)(H,26,27)/t15-/m0/s1
n/an/an/a 0.0920n/an/an/an/an/a
Merck Research Laboratories
Curated by ChEMBL
Assay Description
Equilibrium dissociation constant was measured from displacement of L-762,745 from Fibrinogen receptor of human platelets by flow cytometry
J Med Chem 42: 2409-21 (1999)
Article DOI: 10.1021/jm980722p
BindingDB Entry DOI: 10.7270/Q2HH6J8X