BDBM50078555 (3R,3aS,8aS)-3-(4-Carbamimidoyl-butyl)-5-(3-diethylcarbamoyl-phenyl)-2-oxo-3,3a,8,8a-tetrahydro-2H-indeno[2,1-b]pyrrole-1-carboxylic acid dimethylamide::CHEMBL47143
SMILES: CCN(CC)C(=O)c1cccc(c1)-c1ccc2C[C@H]3[C@@H]([C@@H](CCCCC(N)=N)C(=O)N3C(=O)N(C)C)c2c1
InChI Key: InChIKey=DUMSRSLPMAIPHR-NIYJGHKDSA-N
Data: 3 IC50
Activity Spreadsheet -- Enzyme Inhibition Constant Data from BindingDB
Found 3 hits for monomerid = 50078555
Trg + Lig
Ki
nM
ΔG°
kcal/mole
IC50
nM
Kd
nM
EC50/IC50
nM
koff
s-1
kon
M-1s-1
pHTemp
°C
Prothrombin
(Homo sapiens (Human))
BDBM50078555
((3R,3aS,8aS)-3-(4-Carbamimidoyl-butyl)-5-(3-diethy...)
Show SMILES CCN(CC)C(=O)c1cccc(c1)-c1ccc2C[C@H]3[C@@H]([C@@H](CCCCC(N)=N)C(=O)N3C(=O)N(C)C)c2c1
Show InChI InChI=1S/C30H39N5O3/c1-5-34(6-2)28(36)22-11-9-10-19(16-22)20-14-15-21-18-25-27(24(21)17-20)23(12-7-8-13-26(31)32)29(37)35(25)30(38)33(3)4/h9-11,14-17,23,25,27H,5-8,12-13,18H2,1-4H3,(H3,31,32)/t23-,25+,27+/m1/s1
n/an/a 1.10E+4n/an/an/an/an/an/a
Glaxo Wellcome Research and Development
Curated by ChEMBL
Assay Description
Inhibition of thrombin
Bioorg Med Chem Lett 9: 1657-62 (1999)
BindingDB Entry DOI: 10.7270/Q2VT1R8Q
Trypsin-1
(Homo sapiens (Human))
BDBM50078555
((3R,3aS,8aS)-3-(4-Carbamimidoyl-butyl)-5-(3-diethy...)
Show SMILES CCN(CC)C(=O)c1cccc(c1)-c1ccc2C[C@H]3[C@@H]([C@@H](CCCCC(N)=N)C(=O)N3C(=O)N(C)C)c2c1
Show InChI InChI=1S/C30H39N5O3/c1-5-34(6-2)28(36)22-11-9-10-19(16-22)20-14-15-21-18-25-27(24(21)17-20)23(12-7-8-13-26(31)32)29(37)35(25)30(38)33(3)4/h9-11,14-17,23,25,27H,5-8,12-13,18H2,1-4H3,(H3,31,32)/t23-,25+,27+/m1/s1
Reactome pathway
n/an/a>2.00E+4n/an/an/an/an/an/a
Glaxo Wellcome Research and Development
Curated by ChEMBL
Assay Description
Inhibition of trypsin
Bioorg Med Chem Lett 9: 1657-62 (1999)
BindingDB Entry DOI: 10.7270/Q2VT1R8Q
Coagulation factor X
(Homo sapiens (Human))
BDBM50078555
((3R,3aS,8aS)-3-(4-Carbamimidoyl-butyl)-5-(3-diethy...)
Show SMILES CCN(CC)C(=O)c1cccc(c1)-c1ccc2C[C@H]3[C@@H]([C@@H](CCCCC(N)=N)C(=O)N3C(=O)N(C)C)c2c1
Show InChI InChI=1S/C30H39N5O3/c1-5-34(6-2)28(36)22-11-9-10-19(16-22)20-14-15-21-18-25-27(24(21)17-20)23(12-7-8-13-26(31)32)29(37)35(25)30(38)33(3)4/h9-11,14-17,23,25,27H,5-8,12-13,18H2,1-4H3,(H3,31,32)/t23-,25+,27+/m1/s1
Reactome pathway
n/an/a>2.00E+4n/an/an/an/an/an/a
Glaxo Wellcome Research and Development
Curated by ChEMBL
Assay Description
Inhibition of activated Coagulation factor X
Bioorg Med Chem Lett 9: 1657-62 (1999)
BindingDB Entry DOI: 10.7270/Q2VT1R8Q