BDBM50078571 (R)-2-[[(Benzhydryl-carbamoyl)-methyl]-(4-methoxy-benzenesulfonyl)-amino]-4-benzylsulfanyl-N-hydroxy-butyramide::CHEMBL47468
SMILES: COc1ccc(cc1)S(=O)(=O)N(CC(=O)NC(c1ccccc1)c1ccccc1)[C@H](CCSCc1ccccc1)C(=O)NO
InChI Key: InChIKey=WHTRIFCXCJYQKX-SSEXGKCCSA-N
Data: 4 IC50
Activity Spreadsheet -- Enzyme Inhibition Constant Data from BindingDB
Found 4 hits for monomerid = 50078571
Trg + Lig
Ki
nM
ΔG°
kcal/mole
IC50
nM
Kd
nM
EC50/IC50
nM
koff
s-1
kon
M-1s-1
pHTemp
°C
Collagenase 3
(Homo sapiens (Human))
BDBM50078571
((R)-2-[[(Benzhydryl-carbamoyl)-methyl]-(4-methoxy-...)
Show SMILES COc1ccc(cc1)S(=O)(=O)N(CC(=O)NC(c1ccccc1)c1ccccc1)[C@H](CCSCc1ccccc1)C(=O)NO
Show InChI InChI=1S/C33H35N3O6S2/c1-42-28-17-19-29(20-18-28)44(40,41)36(30(33(38)35-39)21-22-43-24-25-11-5-2-6-12-25)23-31(37)34-32(26-13-7-3-8-14-26)27-15-9-4-10-16-27/h2-20,30,32,39H,21-24H2,1H3,(H,34,37)(H,35,38)/t30-/m1/s1
NCI pathway
Reactome pathway
n/an/a 4.5n/an/an/an/an/an/a
Universit£ de Montr£al
Curated by ChEMBL
Assay Description
Inhibition of matrix metalloprotease-13
Bioorg Med Chem Lett 9: 1691-6 (1999)
BindingDB Entry DOI: 10.7270/Q20002K2
Stromelysin-1
(Homo sapiens (Human))
BDBM50078571
((R)-2-[[(Benzhydryl-carbamoyl)-methyl]-(4-methoxy-...)
Show SMILES COc1ccc(cc1)S(=O)(=O)N(CC(=O)NC(c1ccccc1)c1ccccc1)[C@H](CCSCc1ccccc1)C(=O)NO
Show InChI InChI=1S/C33H35N3O6S2/c1-42-28-17-19-29(20-18-28)44(40,41)36(30(33(38)35-39)21-22-43-24-25-11-5-2-6-12-25)23-31(37)34-32(26-13-7-3-8-14-26)27-15-9-4-10-16-27/h2-20,30,32,39H,21-24H2,1H3,(H,34,37)(H,35,38)/t30-/m1/s1
Reactome pathway
n/an/a 3.70n/an/an/an/an/an/a
Universit£ de Montr£al
Curated by ChEMBL
Assay Description
Inhibition of matrix metalloprotease-3
Bioorg Med Chem Lett 9: 1691-6 (1999)
BindingDB Entry DOI: 10.7270/Q20002K2
Matrix metalloproteinase 9
(Mus musculus)
BDBM50078571
((R)-2-[[(Benzhydryl-carbamoyl)-methyl]-(4-methoxy-...)
Show SMILES COc1ccc(cc1)S(=O)(=O)N(CC(=O)NC(c1ccccc1)c1ccccc1)[C@H](CCSCc1ccccc1)C(=O)NO
Show InChI InChI=1S/C33H35N3O6S2/c1-42-28-17-19-29(20-18-28)44(40,41)36(30(33(38)35-39)21-22-43-24-25-11-5-2-6-12-25)23-31(37)34-32(26-13-7-3-8-14-26)27-15-9-4-10-16-27/h2-20,30,32,39H,21-24H2,1H3,(H,34,37)(H,35,38)/t30-/m1/s1
Reactome pathway
n/an/a 0.5n/an/an/an/an/an/a
Universit£ de Montr£al
Curated by ChEMBL
Assay Description
Inhibitory concentration required against matrix metalloprotease-9 (MMP-9 gelatinase B)
Bioorg Med Chem Lett 9: 1691-6 (1999)
BindingDB Entry DOI: 10.7270/Q20002K2
Matrix metalloproteinase-2
(Mus musculus)
BDBM50078571
((R)-2-[[(Benzhydryl-carbamoyl)-methyl]-(4-methoxy-...)
Show SMILES COc1ccc(cc1)S(=O)(=O)N(CC(=O)NC(c1ccccc1)c1ccccc1)[C@H](CCSCc1ccccc1)C(=O)NO
Show InChI InChI=1S/C33H35N3O6S2/c1-42-28-17-19-29(20-18-28)44(40,41)36(30(33(38)35-39)21-22-43-24-25-11-5-2-6-12-25)23-31(37)34-32(26-13-7-3-8-14-26)27-15-9-4-10-16-27/h2-20,30,32,39H,21-24H2,1H3,(H,34,37)(H,35,38)/t30-/m1/s1
Reactome pathway
n/an/a 2.30n/an/an/an/an/an/a
Universit£ de Montr£al
Curated by ChEMBL
Assay Description
Inhibition of matrix metalloprotease-2
Bioorg Med Chem Lett 9: 1691-6 (1999)
BindingDB Entry DOI: 10.7270/Q20002K2