BDBM50078638 CHEMBL3415182
SMILES: Cc1cn(CCn2cnc(-c3cnn(C)c3)c2-c2ccc(cc2)C#N)nn1
InChI Key: InChIKey=YPRKVQKJNRKXFN-UHFFFAOYSA-N
Data: 2 IC50
PDB links: 1 PDB ID matches this monomer.
Activity Spreadsheet -- Enzyme Inhibition Constant Data from BindingDB
Found 1 hit for monomerid = 50078638
Trg + Lig
Ki
nM
ΔG°
kcal/mole
IC50
nM
Kd
nM
EC50/IC50
nM
koff
s-1
kon
M-1s-1
pHTemp
°C
Metabotropic glutamate receptor 4
(Homo sapiens (Human))
BDBM50078638
(CHEMBL4764520)
Show SMILES Cc1cn(CCn2cnc(-c3cnn(C)c3)c2-c2ccc(cc2)C#N)nn1
Show InChI InChI=1S/C19H18N8/c1-14-11-27(24-23-14)8-7-26-13-21-18(17-10-22-25(2)12-17)19(26)16-5-3-15(9-20)4-6-16/h3-6,10-13H,7-8H2,1-2H3
n/an/an/an/a>1.00E+4n/an/an/an/a
TBA
Assay Description
Inhibition of human urine urokinase using L-PyroGlu-Gly-Arg-pNA.HCl substrate at 5 uM
Citation and Details