BDBM50078655 CHEMBL49824::N-[5-(5H,11H-Benzo[e]pyrrolo[1,2-a][1,4]diazepine-10-carbonyl)-pyridin-2-yl]-2-chloro-6-fluoro-benzamide
SMILES: Fc1cccc(Cl)c1C(=O)Nc1ccc(cn1)C(=O)N1Cc2cccn2Cc2ccccc12
InChI Key: InChIKey=OBUWZFZAMGFWIN-UHFFFAOYSA-N
Data: 2 IC50
Activity Spreadsheet -- Enzyme Inhibition Constant Data from BindingDB
Found 2 hits for monomerid = 50078655
Trg + Lig
Ki
nM
ΔG°
kcal/mole
IC50
nM
Kd
nM
EC50/IC50
nM
koff
s-1
kon
M-1s-1
pHTemp
°C
AVPR1A
(RAT)
BDBM50078655
(CHEMBL49824 | N-[5-(5H,11H-Benzo[e]pyrrolo[1,2-a][...)
Show SMILES Fc1cccc(Cl)c1C(=O)Nc1ccc(cn1)C(=O)N1Cc2cccn2Cc2ccccc12
Show InChI InChI=1S/C25H18ClFN4O2/c26-19-7-3-8-20(27)23(19)24(32)29-22-11-10-16(13-28-22)25(33)31-15-18-6-4-12-30(18)14-17-5-1-2-9-21(17)31/h1-13H,14-15H2,(H,28,29,32)
n/an/a 40n/an/an/an/an/an/a
Wyeth-Ayerst Research
Curated by ChEMBL
Assay Description
Displacement of (Phe-3,4,5 [3H]-) AVP from isolated rat hepatic V1a receptor
Bioorg Med Chem Lett 9: 1737-40 (1999)
BindingDB Entry DOI: 10.7270/Q23B5ZBZ
Vasopressin V2 Receptor
(Rattus norvegicus (Rat))
BDBM50078655
(CHEMBL49824 | N-[5-(5H,11H-Benzo[e]pyrrolo[1,2-a][...)
Show SMILES Fc1cccc(Cl)c1C(=O)Nc1ccc(cn1)C(=O)N1Cc2cccn2Cc2ccccc12
Show InChI InChI=1S/C25H18ClFN4O2/c26-19-7-3-8-20(27)23(19)24(32)29-22-11-10-16(13-28-22)25(33)31-15-18-6-4-12-30(18)14-17-5-1-2-9-21(17)31/h1-13H,14-15H2,(H,28,29,32)
Reactome pathway
n/an/a 4n/an/an/an/an/an/a
Wyeth-Ayerst Research
Curated by ChEMBL
Assay Description
Displacement of P[3H]-AVP from isolated rat kidney medullary V2 receptor
Bioorg Med Chem Lett 9: 1737-40 (1999)
BindingDB Entry DOI: 10.7270/Q23B5ZBZ