BDBM50078723 (S)-2-[(4-tert-Butyl-benzyl)-methyl-amino]-4-methyl-pentanoic acid [(S)-2-(4-benzyloxy-phenyl)-1-tert-butylcarbamoyl-ethyl]-amide::CHEMBL299749
SMILES: CC(C)C[C@H](N(C)Cc1ccc(cc1)C(C)(C)C)C(=O)N[C@@H](Cc1ccc(OCc2ccccc2)cc1)C(=O)NC(C)(C)C
InChI Key: InChIKey=GCDHMGROXQUFNR-HEVIKAOCSA-N
Data: 1 IC50
PDB links: 1 PDB ID matches this monomer.
Activity Spreadsheet -- Enzyme Inhibition Constant Data from BindingDB
Found 1 hit for monomerid = 50078723
Trg + Lig
Ki
nM
ΔG°
kcal/mole
IC50
nM
Kd
nM
EC50/IC50
nM
koff
s-1
kon
M-1s-1
pHTemp
°C
Voltage-gated calcium channel subunit alpha Cav2.2
(Homo sapiens (Human))
BDBM50078723
((S)-2-[(4-tert-Butyl-benzyl)-methyl-amino]-4-methy...)
Show SMILES CC(C)C[C@H](N(C)Cc1ccc(cc1)C(C)(C)C)C(=O)N[C@@H](Cc1ccc(OCc2ccccc2)cc1)C(=O)NC(C)(C)C
Show InChI InChI=1S/C38H53N3O3/c1-27(2)23-34(41(9)25-29-15-19-31(20-16-29)37(3,4)5)36(43)39-33(35(42)40-38(6,7)8)24-28-17-21-32(22-18-28)44-26-30-13-11-10-12-14-30/h10-22,27,33-34H,23-26H2,1-9H3,(H,39,43)(H,40,42)/t33-,34-/m0/s1
n/an/a 40n/an/an/an/an/an/a
Warner-Lambert Company
Curated by ChEMBL
Assay Description
In vitro antagonism of N-type voltage sensitive calcium channel in IMR-32 assay using fluorescent [Ca2+] indicator Indo-11 in the presence of 5 micro...
Bioorg Med Chem Lett 9: 1813-8 (1999)
BindingDB Entry DOI: 10.7270/Q2KD1X3X
3D
3D Structure (crystal)