BDBM50078755 CHEMBL3415451
SMILES: ONC(=O)c1ccc(NC2CCN(Cc3ccccc3)C2=O)cc1
InChI Key: InChIKey=ALXBWSHZBQTFJJ-UHFFFAOYSA-N
Data: 3 IC50  1 EC50
Activity Spreadsheet -- Enzyme Inhibition Constant Data from BindingDB
Found 4 hits for monomerid = 50078755
Trg + Lig
Ki
nM
ΔG°
kcal/mole
IC50
nM
Kd
nM
EC50/IC50
nM
koff
s-1
kon
M-1s-1
pHTemp
°C
Cereblon/Histone deacetylase 6
(Homo sapiens (Human))
BDBM50078755
(CHEMBL3415451)
Show SMILES ONC(=O)c1ccc(NC2CCN(Cc3ccccc3)C2=O)cc1
Show InChI InChI=1S/C18H19N3O3/c22-17(20-24)14-6-8-15(9-7-14)19-16-10-11-21(18(16)23)12-13-4-2-1-3-5-13/h1-9,16,19,24H,10-12H2,(H,20,22)
NCI pathway
Reactome pathway
n/an/a 510n/an/an/an/an/an/a
Roche Innovation Center Shanghai
Curated by ChEMBL
Assay Description
Inhibition of HDAC6 (unknown origin) using RHKK(Ac)AMC as substrate
J Med Chem 58: 2809-20 (2015)
Article DOI: 10.1021/jm502011f
BindingDB Entry DOI: 10.7270/Q2B56MF0
Histone deacetylase 1
(Homo sapiens (Human))
BDBM50078755
(CHEMBL3415451)
Show SMILES ONC(=O)c1ccc(NC2CCN(Cc3ccccc3)C2=O)cc1
Show InChI InChI=1S/C18H19N3O3/c22-17(20-24)14-6-8-15(9-7-14)19-16-10-11-21(18(16)23)12-13-4-2-1-3-5-13/h1-9,16,19,24H,10-12H2,(H,20,22)
NCI pathway
Reactome pathway
n/an/a 1.17E+4n/an/an/an/an/an/a
Roche Innovation Center Shanghai
Curated by ChEMBL
Assay Description
Inhibition of HDAC1 (unknown origin) using RHKK(Ac)AMC as substrate
J Med Chem 58: 2809-20 (2015)
Article DOI: 10.1021/jm502011f
BindingDB Entry DOI: 10.7270/Q2B56MF0
Cereblon/Histone deacetylase 6
(Homo sapiens (Human))
BDBM50078755
(CHEMBL3415451)
Show SMILES ONC(=O)c1ccc(NC2CCN(Cc3ccccc3)C2=O)cc1
Show InChI InChI=1S/C18H19N3O3/c22-17(20-24)14-6-8-15(9-7-14)19-16-10-11-21(18(16)23)12-13-4-2-1-3-5-13/h1-9,16,19,24H,10-12H2,(H,20,22)
NCI pathway
Reactome pathway
n/an/an/an/a 1.14E+4n/an/an/an/a
Roche Innovation Center Shanghai
Curated by ChEMBL
Assay Description
Inhibition of HDAC6 in human A549 cells assessed as induction of tubulin acetylation after 17 to 18 hrs by ELISA
J Med Chem 58: 2809-20 (2015)
Article DOI: 10.1021/jm502011f
BindingDB Entry DOI: 10.7270/Q2B56MF0
Histone deacetylase 8
(Homo sapiens (Human))
BDBM50078755
(CHEMBL3415451)
Show SMILES ONC(=O)c1ccc(NC2CCN(Cc3ccccc3)C2=O)cc1
Show InChI InChI=1S/C18H19N3O3/c22-17(20-24)14-6-8-15(9-7-14)19-16-10-11-21(18(16)23)12-13-4-2-1-3-5-13/h1-9,16,19,24H,10-12H2,(H,20,22)
NCI pathway
Reactome pathway
n/an/a 760n/an/an/an/an/an/a
Roche Innovation Center Shanghai
Curated by ChEMBL
Assay Description
Inhibition of HDAC8 (unknown origin) using RHK(Ac)K(Ac)AMC as substrate
J Med Chem 58: 2809-20 (2015)
Article DOI: 10.1021/jm502011f
BindingDB Entry DOI: 10.7270/Q2B56MF0