BDBM50078874 CHEMBL3416355
SMILES: CCCCCCC1=C(OC)C(OC)=CC(=O)C1=O
InChI Key: InChIKey=UKJFNQIKAIUAIA-UHFFFAOYSA-N
Data: 4 IC50
Activity Spreadsheet -- Enzyme Inhibition Constant Data from BindingDB
Found 4 hits for monomerid = 50078874
Trg + Lig
Ki
nM
ΔG°
kcal/mole
IC50
nM
Kd
nM
EC50/IC50
nM
koff
s-1
kon
M-1s-1
pHTemp
°C
Arachidonate 5-lipoxygenase
(Homo sapiens (Human))
BDBM50078874
(CHEMBL3416355)
Show SMILES CCCCCCC1=C(OC)C(OC)=CC(=O)C1=O |c:6,12|
Show InChI InChI=1S/C14H20O4/c1-4-5-6-7-8-10-13(16)11(15)9-12(17-2)14(10)18-3/h9H,4-8H2,1-3H3
Reactome pathway
n/an/a 330n/an/an/an/an/an/a
University of Naples
Curated by ChEMBL
Assay Description
Inhibition of 5-LOX in A23187-stimulated human blood PMNL assessed as reduction in lipoxygenase products formation pre-incubated for 15 mins followed...
Eur J Med Chem 94: 132-9 (2015)
Article DOI: 10.1016/j.ejmech.2015.02.042
BindingDB Entry DOI: 10.7270/Q2T72K5H
Macrophage-expressed gene 1 protein
(Homo sapiens (Human))
BDBM50078874
(CHEMBL3416355)
Show SMILES CCCCCCC1=C(OC)C(OC)=CC(=O)C1=O |c:6,12|
Show InChI InChI=1S/C14H20O4/c1-4-5-6-7-8-10-13(16)11(15)9-12(17-2)14(10)18-3/h9H,4-8H2,1-3H3
n/an/a>1.00E+4n/an/an/an/an/an/a
University of Naples
Curated by ChEMBL
Assay Description
Inhibition of mPGES1 in IL-1beta stimulated human A549 cell microsomal membranes assessed as reduction in PGE2 synthase activity after 15 mins using ...
Eur J Med Chem 94: 132-9 (2015)
Article DOI: 10.1016/j.ejmech.2015.02.042
BindingDB Entry DOI: 10.7270/Q2T72K5H
Arachidonate 5-lipoxygenase
(Homo sapiens (Human))
BDBM50078874
(CHEMBL3416355)
Show SMILES CCCCCCC1=C(OC)C(OC)=CC(=O)C1=O |c:6,12|
Show InChI InChI=1S/C14H20O4/c1-4-5-6-7-8-10-13(16)11(15)9-12(17-2)14(10)18-3/h9H,4-8H2,1-3H3
Reactome pathway
n/an/a 990n/an/an/an/an/an/a
University of Naples
Curated by ChEMBL
Assay Description
Inhibition of 5-LOX in A23187-stimulated human blood PMNL assessed as reduction in lipoxygenase products formation in presence of arachidonic acid pr...
Eur J Med Chem 94: 132-9 (2015)
Article DOI: 10.1016/j.ejmech.2015.02.042
BindingDB Entry DOI: 10.7270/Q2T72K5H
Arachidonate 5-lipoxygenase
(Homo sapiens (Human))
BDBM50078874
(CHEMBL3416355)
Show SMILES CCCCCCC1=C(OC)C(OC)=CC(=O)C1=O |c:6,12|
Show InChI InChI=1S/C14H20O4/c1-4-5-6-7-8-10-13(16)11(15)9-12(17-2)14(10)18-3/h9H,4-8H2,1-3H3
Reactome pathway
n/an/a 2.60E+3n/an/an/an/an/an/a
University of Naples
Curated by ChEMBL
Assay Description
Inhibition of human recombinant 5-LOX expressed in Escherichia coli BL21 incubated for 10 mins in presence of arachidonic acid by RP-HPLC based cell-...
Eur J Med Chem 94: 132-9 (2015)
Article DOI: 10.1016/j.ejmech.2015.02.042
BindingDB Entry DOI: 10.7270/Q2T72K5H