BDBM50079329 CHEMBL3416792
SMILES: CCNC(=O)[C@H]1O[C@H]([C@H](O)[C@@H]1O)n1cnc2c(N)nc(NCCN3CCN(CC3)c3ccccc3F)nc12
InChI Key: InChIKey=WASZKNXEGGPPSK-QPXQOZNCSA-N
Data: 3 KI  2 EC50
Activity Spreadsheet -- Enzyme Inhibition Constant Data from BindingDB
Found 5 hits for monomerid = 50079329
Trg + Lig
Ki
nM
ΔG°
kcal/mole
IC50
nM
Kd
nM
EC50/IC50
nM
koff
s-1
kon
M-1s-1
pHTemp
°C
Adenosine receptor A2a
(Homo sapiens (Human))
BDBM50079329
(CHEMBL3416792)
Show SMILES CCNC(=O)[C@H]1O[C@H]([C@H](O)[C@@H]1O)n1cnc2c(N)nc(NCCN3CCN(CC3)c3ccccc3F)nc12 |r|
Show InChI InChI=1S/C24H32FN9O4/c1-2-27-22(37)19-17(35)18(36)23(38-19)34-13-29-16-20(26)30-24(31-21(16)34)28-7-8-32-9-11-33(12-10-32)15-6-4-3-5-14(15)25/h3-6,13,17-19,23,35-36H,2,7-12H2,1H3,(H,27,37)(H3,26,28,30,31)/t17-,18+,19-,23+/m0/s1
NCI pathway
Reactome pathway
7.80n/an/an/an/an/an/an/an/a
Universit£ degli Studi di Ferrara
Curated by ChEMBL
Assay Description
Displacement of [3H]CGS21680 from human adenosine A2A receptor expressed in CHO cell membranes incubated for 120 mins by scintillation counting metho...
J Med Chem 58: 3253-67 (2015)
Article DOI: 10.1021/acs.jmedchem.5b00215
BindingDB Entry DOI: 10.7270/Q2X068RF
Adenosine receptor A3
(Homo sapiens (Human))
BDBM50079329
(CHEMBL3416792)
Show SMILES CCNC(=O)[C@H]1O[C@H]([C@H](O)[C@@H]1O)n1cnc2c(N)nc(NCCN3CCN(CC3)c3ccccc3F)nc12 |r|
Show InChI InChI=1S/C24H32FN9O4/c1-2-27-22(37)19-17(35)18(36)23(38-19)34-13-29-16-20(26)30-24(31-21(16)34)28-7-8-32-9-11-33(12-10-32)15-6-4-3-5-14(15)25/h3-6,13,17-19,23,35-36H,2,7-12H2,1H3,(H,27,37)(H3,26,28,30,31)/t17-,18+,19-,23+/m0/s1
Reactome pathway
1.87E+3n/an/an/an/an/an/an/an/a
Universit£ degli Studi di Ferrara
Curated by ChEMBL
Assay Description
Displacement of [3H]AB-MECA from human adenosine A3 receptor expressed in CHO cell membranes incubated for 30 mins by scintillation counting method
J Med Chem 58: 3253-67 (2015)
Article DOI: 10.1021/acs.jmedchem.5b00215
BindingDB Entry DOI: 10.7270/Q2X068RF
Adenosine receptor A1
(Homo sapiens (Human))
BDBM50079329
(CHEMBL3416792)
Show SMILES CCNC(=O)[C@H]1O[C@H]([C@H](O)[C@@H]1O)n1cnc2c(N)nc(NCCN3CCN(CC3)c3ccccc3F)nc12 |r|
Show InChI InChI=1S/C24H32FN9O4/c1-2-27-22(37)19-17(35)18(36)23(38-19)34-13-29-16-20(26)30-24(31-21(16)34)28-7-8-32-9-11-33(12-10-32)15-6-4-3-5-14(15)25/h3-6,13,17-19,23,35-36H,2,7-12H2,1H3,(H,27,37)(H3,26,28,30,31)/t17-,18+,19-,23+/m0/s1
Reactome pathway
>1.00E+4n/an/an/an/an/an/an/an/a
Universit£ degli Studi di Ferrara
Curated by ChEMBL
Assay Description
Displacement of [3H]CCPA from human adenosine A1 receptor expressed in CHO cell membranes incubated for 120 mins by scintillation counting method
J Med Chem 58: 3253-67 (2015)
Article DOI: 10.1021/acs.jmedchem.5b00215
BindingDB Entry DOI: 10.7270/Q2X068RF
Adenosine receptor A2b
(Homo sapiens (Human))
BDBM50079329
(CHEMBL3416792)
Show SMILES CCNC(=O)[C@H]1O[C@H]([C@H](O)[C@@H]1O)n1cnc2c(N)nc(NCCN3CCN(CC3)c3ccccc3F)nc12 |r|
Show InChI InChI=1S/C24H32FN9O4/c1-2-27-22(37)19-17(35)18(36)23(38-19)34-13-29-16-20(26)30-24(31-21(16)34)28-7-8-32-9-11-33(12-10-32)15-6-4-3-5-14(15)25/h3-6,13,17-19,23,35-36H,2,7-12H2,1H3,(H,27,37)(H3,26,28,30,31)/t17-,18+,19-,23+/m0/s1
NCI pathway
Reactome pathway
n/an/an/an/a>1.00E+4n/an/an/an/a
Universit£ degli Studi di Ferrara
Curated by ChEMBL
Assay Description
Agonist activity at human adenosine A2B receptor expressed in CHO cells assessed as stimulation of [3H]cAMP levels by scintillation counting method
J Med Chem 58: 3253-67 (2015)
Article DOI: 10.1021/acs.jmedchem.5b00215
BindingDB Entry DOI: 10.7270/Q2X068RF
Adenosine receptor A2a
(Homo sapiens (Human))
BDBM50079329
(CHEMBL3416792)
Show SMILES CCNC(=O)[C@H]1O[C@H]([C@H](O)[C@@H]1O)n1cnc2c(N)nc(NCCN3CCN(CC3)c3ccccc3F)nc12 |r|
Show InChI InChI=1S/C24H32FN9O4/c1-2-27-22(37)19-17(35)18(36)23(38-19)34-13-29-16-20(26)30-24(31-21(16)34)28-7-8-32-9-11-33(12-10-32)15-6-4-3-5-14(15)25/h3-6,13,17-19,23,35-36H,2,7-12H2,1H3,(H,27,37)(H3,26,28,30,31)/t17-,18+,19-,23+/m0/s1
NCI pathway
Reactome pathway
n/an/an/an/a 12n/an/an/an/a
Universit£ degli Studi di Ferrara
Curated by ChEMBL
Assay Description
Agonist activity at human adenosine A2A receptor expressed in CHO cells assessed as stimulation of [3H]cAMP levels by scintillation counting method
J Med Chem 58: 3253-67 (2015)
Article DOI: 10.1021/acs.jmedchem.5b00215
BindingDB Entry DOI: 10.7270/Q2X068RF