BDBM50079554 CHEMBL3417478
SMILES: Fc1ccc2ccn(-c3ccc(=O)n(Cc4cccc(NC(=O)OCCCCN5CCOCC5)c4)n3)c2c1
InChI Key: InChIKey=FIFFKGUJOGLHFQ-UHFFFAOYSA-N
Data: 1 IC50
Activity Spreadsheet -- Enzyme Inhibition Constant Data from BindingDB
Found 1 hit for monomerid = 50079554
Trg + Lig
Ki
nM
ΔG°
kcal/mole
IC50
nM
Kd
nM
EC50/IC50
nM
koff
s-1
kon
M-1s-1
pHTemp
°C
Hepatocyte growth factor receptor
(Homo sapiens (Human))
BDBM50079554
(CHEMBL3417478)
Show SMILES Fc1ccc2ccn(-c3ccc(=O)n(Cc4cccc(NC(=O)OCCCCN5CCOCC5)c4)n3)c2c1
Show InChI InChI=1S/C28H30FN5O4/c29-23-7-6-22-10-12-33(25(22)19-23)26-8-9-27(35)34(31-26)20-21-4-3-5-24(18-21)30-28(36)38-15-2-1-11-32-13-16-37-17-14-32/h3-10,12,18-19H,1-2,11,13-17,20H2,(H,30,36)
n/an/a 24n/an/an/an/an/an/a
Chinese Academy of Sciences
Curated by ChEMBL
Assay Description
Inhibition of recombinant c-Met (unknown origin) using poly (Glu,Tyr)4:1 substrate incubated for 60 mins by ELISA method
Eur J Med Chem 95: 302-12 (2015)
Article DOI: 10.1016/j.ejmech.2015.03.041
BindingDB Entry DOI: 10.7270/Q2GQ70G4