BDBM50079571 CHEMBL3417495
SMILES: CN(C)CCCCOC(=O)Nc1cccc(Cn2nc(ccc2=O)-n2ccc3ccc(C)cc23)c1
InChI Key: InChIKey=IEHJKOVLBYSKHB-UHFFFAOYSA-N
Data: 1 IC50
Activity Spreadsheet -- Enzyme Inhibition Constant Data from BindingDB
Found 1 hit for monomerid = 50079571
Trg + Lig
Ki
nM
ΔG°
kcal/mole
IC50
nM
Kd
nM
EC50/IC50
nM
koff
s-1
kon
M-1s-1
pHTemp
°C
Hepatocyte growth factor receptor
(Homo sapiens (Human))
BDBM50079571
(CHEMBL3417495)
Show SMILES CN(C)CCCCOC(=O)Nc1cccc(Cn2nc(ccc2=O)-n2ccc3ccc(C)cc23)c1
Show InChI InChI=1S/C27H31N5O3/c1-20-9-10-22-13-15-31(24(22)17-20)25-11-12-26(33)32(29-25)19-21-7-6-8-23(18-21)28-27(34)35-16-5-4-14-30(2)3/h6-13,15,17-18H,4-5,14,16,19H2,1-3H3,(H,28,34)
n/an/a 151n/an/an/an/an/an/a
Chinese Academy of Sciences
Curated by ChEMBL
Assay Description
Inhibition of recombinant c-Met (unknown origin) using poly (Glu,Tyr)4:1 substrate incubated for 60 mins by ELISA method
Eur J Med Chem 95: 302-12 (2015)
Article DOI: 10.1016/j.ejmech.2015.03.041
BindingDB Entry DOI: 10.7270/Q2GQ70G4