BDBM50079713 CHEMBL3414794
SMILES: COc1ccc(cc1)-c1cc(NC(=O)N[C@@H](Cc2c[nH]c3ccccc23)C(O)=O)c(s1)C(O)=O
InChI Key:
Data: 1 IC50
Activity Spreadsheet -- Enzyme Inhibition Constant Data from BindingDB
Found 1 hit for monomerid = 50079713
Trg + Lig
Ki
nM
ΔG°
kcal/mole
IC50
nM
Kd
nM
EC50/IC50
nM
koff
s-1
kon
M-1s-1
pHTemp
°C
2-heptyl-4(1H)-quinolone synthase PqsD
(Pseudomonas aeruginosa)
BDBM50079713
(CHEMBL3414794)
Show SMILES COc1ccc(cc1)-c1cc(NC(=O)N[C@@H](Cc2c[nH]c3ccccc23)C(O)=O)c(s1)C(O)=O |r|
n/an/a 5.00E+3n/an/an/an/an/an/a
Saarland University& Helmholtz Institute for Pharmaceutical Research Saarland (HIPS)
Curated by ChEMBL
Assay Description
Inhibition of recombinant His6-tagged Pseudomonas aeruginosa PqsD expressed in Escherichia coli BL21 (deltaDE3) using anthraniloyl-CoA/beta-ketodecan...
Eur J Med Chem 96: 14-21 (2015)
Article DOI: 10.1016/j.ejmech.2015.04.007
BindingDB Entry DOI: 10.7270/Q2ZS2Z7Q