BDBM50079748 CHEMBL3414793
SMILES: COc1ccc(cc1)-c1cc(NC(=O)N[C@@H](CC(N)=O)C(O)=O)c(s1)C(O)=O
InChI Key: InChIKey=GFMWPELIMBBMFB-NSHDSACASA-N
Data: 1 IC50
Activity Spreadsheet -- Enzyme Inhibition Constant Data from BindingDB
Found 1 hit for monomerid = 50079748
Trg + Lig
Ki
nM
ΔG°
kcal/mole
IC50
nM
Kd
nM
EC50/IC50
nM
koff
s-1
kon
M-1s-1
pHTemp
°C
2-heptyl-4(1H)-quinolone synthase PqsD
(Pseudomonas aeruginosa)
BDBM50079748
(CHEMBL3414793)
Show SMILES COc1ccc(cc1)-c1cc(NC(=O)N[C@@H](CC(N)=O)C(O)=O)c(s1)C(O)=O |r|
Show InChI InChI=1S/C17H17N3O7S/c1-27-9-4-2-8(3-5-9)12-6-10(14(28-12)16(24)25)19-17(26)20-11(15(22)23)7-13(18)21/h2-6,11H,7H2,1H3,(H2,18,21)(H,22,23)(H,24,25)(H2,19,20,26)/t11-/m0/s1
n/an/a 1.32E+4n/an/an/an/an/an/a
Saarland University& Helmholtz Institute for Pharmaceutical Research Saarland (HIPS)
Curated by ChEMBL
Assay Description
Inhibition of recombinant His6-tagged Pseudomonas aeruginosa PqsD expressed in Escherichia coli BL21 (deltaDE3) using anthraniloyl-CoA/beta-ketodecan...
Eur J Med Chem 96: 14-21 (2015)
Article DOI: 10.1016/j.ejmech.2015.04.007
BindingDB Entry DOI: 10.7270/Q2ZS2Z7Q