BDBM50079819 1-[(2,4-Dichloro-phenyl)-(2,3-dihydro-benzofuran-2-yl)-methyl]-1H-tetrazole::CHEMBL65549
SMILES: Clc1ccc(C(C2Cc3ccccc3O2)n2cnnn2)c(Cl)c1
InChI Key: InChIKey=FSWJQLLWPOKRJJ-UHFFFAOYSA-N
Data: 1 IC50
Activity Spreadsheet -- Enzyme Inhibition Constant Data from BindingDB
Found 1 hit for monomerid = 50079819
Trg + Lig
Ki
nM
ΔG°
kcal/mole
IC50
nM
Kd
nM
EC50/IC50
nM
koff
s-1
kon
M-1s-1
pHTemp
°C
Cytochrome P450 19A1
(Homo sapiens (Human))
BDBM50079819
(1-[(2,4-Dichloro-phenyl)-(2,3-dihydro-benzofuran-2...)
Show SMILES Clc1ccc(C(C2Cc3ccccc3O2)n2cnnn2)c(Cl)c1
Show InChI InChI=1S/C16H12Cl2N4O/c17-11-5-6-12(13(18)8-11)16(22-9-19-20-21-22)15-7-10-3-1-2-4-14(10)23-15/h1-6,8-9,15-16H,7H2
Reactome pathway
n/an/a 5.20E+4n/an/an/an/an/an/a
Cardiff University
Curated by ChEMBL
Assay Description
Inhibition of human placental aromatase, cytochrome P450 19A1
Bioorg Med Chem Lett 9: 2105-8 (1999)
BindingDB Entry DOI: 10.7270/Q2SQ8ZK7