BDBM50079831 (S)-2-{(S)-2-[(R)-2-(3-Cyclohexyl-propylamino)-butyrylamino]-pentanoylamino}-4-methyl-pentanoic acid amide::CHEMBL63897
SMILES: CCC[C@H](NC(=O)[C@@H](CC)NCCCC1CCCCC1)C(=O)N[C@@H](CC(C)C)C(N)=O
InChI Key: InChIKey=VZFLYXAPABJESV-HKBOAZHASA-N
Data: 1 IC50
Activity Spreadsheet -- Enzyme Inhibition Constant Data from BindingDB
Found 1 hit for monomerid = 50079831
Trg + Lig
Ki
nM
ΔG°
kcal/mole
IC50
nM
Kd
nM
EC50/IC50
nM
koff
s-1
kon
M-1s-1
pHTemp
°C
MHC class II
(Rattus norvegicus)
BDBM50079831
((S)-2-{(S)-2-[(R)-2-(3-Cyclohexyl-propylamino)-but...)
Show SMILES CCC[C@H](NC(=O)[C@@H](CC)NCCCC1CCCCC1)C(=O)N[C@@H](CC(C)C)C(N)=O
Show InChI InChI=1S/C24H46N4O3/c1-5-11-20(24(31)28-21(22(25)29)16-17(3)4)27-23(30)19(6-2)26-15-10-14-18-12-8-7-9-13-18/h17-21,26H,5-16H2,1-4H3,(H2,25,29)(H,27,30)(H,28,31)/t19-,20+,21+/m1/s1
Reactome pathway
n/an/a>5.00E+4n/an/an/an/an/an/a
Merck Research Laboratories
Curated by ChEMBL
Assay Description
Ability to inhibit binding of biotinylated rat myelin basic protein 13-mer peptide (RMBP 90-102, Major histocompatibility complex class II to purifie...
Bioorg Med Chem Lett 9: 2109-14 (1999)
BindingDB Entry DOI: 10.7270/Q2NZ86TF