BDBM50079884 2-(3-Pentyl-3H-diazirin-3-yl)-ethanol::CHEMBL111864
SMILES:
InChI Key: InChIKey=UFRORYJOZHLIFW-UHFFFAOYSA-N
Data: 1 IC50
Activity Spreadsheet -- Enzyme Inhibition Constant Data from BindingDB
Found 1 hit for monomerid = 50079884
Trg + Lig
Ki
nM
ΔG°
kcal/mole
IC50
nM
Kd
nM
EC50/IC50
nM
koff
s-1
kon
M-1s-1
pHTemp
°C
Cholinergic, Nicotinic Muscle
(RAT)
BDBM50079884
(2-(3-Pentyl-3H-diazirin-3-yl)-ethanol | CHEMBL1118...)
Show InChI InChI=1S/C8H16N2O/c1-2-3-4-5-8(6-7-11)9-10-8/h11H,2-7H2,1H3
Reactome pathway
n/an/a 3.30E+4n/an/an/an/an/an/a
Massachusetts General Hospital
Curated by ChEMBL
Assay Description
The compound was tested for inhibitory potency against Nicotinic acetylcholine receptor in Rat muscle.
J Med Chem 42: 3300-7 (1999)
Article DOI: 10.1021/jm9806300
BindingDB Entry DOI: 10.7270/Q28P5ZPF