BDBM50080568 1-{2-[Bis-(4-fluoro-phenyl)-methoxy]-ethyl}-4-phenethyl-piperazin-2-one::CHEMBL122859
SMILES: Fc1ccc(cc1)C(OCCN1CCN(CCc2ccccc2)CC1=O)c1ccc(F)cc1
InChI Key: InChIKey=UKJAARKQBNAPHJ-UHFFFAOYSA-N
Data: 3 KI  3 IC50
Activity Spreadsheet -- Enzyme Inhibition Constant Data from BindingDB
Found 6 hits for monomerid = 50080568
Trg + Lig
Ki
nM
ΔG°
kcal/mole
IC50
nM
Kd
nM
EC50/IC50
nM
koff
s-1
kon
M-1s-1
pHTemp
°C
Sodium-dependent serotonin transporter
(Homo sapiens (Human))
BDBM50080568
(1-{2-[Bis-(4-fluoro-phenyl)-methoxy]-ethyl}-4-phen...)
Show SMILES Fc1ccc(cc1)C(OCCN1CCN(CCc2ccccc2)CC1=O)c1ccc(F)cc1
Show InChI InChI=1S/C27H28F2N2O2/c28-24-10-6-22(7-11-24)27(23-8-12-25(29)13-9-23)33-19-18-31-17-16-30(20-26(31)32)15-14-21-4-2-1-3-5-21/h1-13,27H,14-20H2
114n/an/an/an/an/an/an/an/a
Massachusetts General Hospital
Curated by ChEMBL
Assay Description
Inhibition of [125I]RTI-55 binding to serotonin transporter (SERT) expressed in HEK cells
J Med Chem 42: 3647-56 (1999)
Article DOI: 10.1021/jm990161h
BindingDB Entry DOI: 10.7270/Q2BG2PPJ
Sodium-dependent dopamine transporter
(Homo sapiens (Human))
BDBM50080568
(1-{2-[Bis-(4-fluoro-phenyl)-methoxy]-ethyl}-4-phen...)
Show SMILES Fc1ccc(cc1)C(OCCN1CCN(CCc2ccccc2)CC1=O)c1ccc(F)cc1
Show InChI InChI=1S/C27H28F2N2O2/c28-24-10-6-22(7-11-24)27(23-8-12-25(29)13-9-23)33-19-18-31-17-16-30(20-26(31)32)15-14-21-4-2-1-3-5-21/h1-13,27H,14-20H2
NCI pathway
Reactome pathway
1.43E+3n/an/an/an/an/an/an/an/a
Massachusetts General Hospital
Curated by ChEMBL
Assay Description
Inhibition of [125I]RTI-55 binding at Dopamine transporter (DAT) expressed in HEK cells
J Med Chem 42: 3647-56 (1999)
Article DOI: 10.1021/jm990161h
BindingDB Entry DOI: 10.7270/Q2BG2PPJ
Sodium-dependent noradrenaline transporter
(Homo sapiens (Human))
BDBM50080568
(1-{2-[Bis-(4-fluoro-phenyl)-methoxy]-ethyl}-4-phen...)
Show SMILES Fc1ccc(cc1)C(OCCN1CCN(CCc2ccccc2)CC1=O)c1ccc(F)cc1
Show InChI InChI=1S/C27H28F2N2O2/c28-24-10-6-22(7-11-24)27(23-8-12-25(29)13-9-23)33-19-18-31-17-16-30(20-26(31)32)15-14-21-4-2-1-3-5-21/h1-13,27H,14-20H2
Reactome pathway
7.05E+3n/an/an/an/an/an/an/an/a
Massachusetts General Hospital
Curated by ChEMBL
Assay Description
Inhibition of [125I]RTI-55 binding to norepinephrine transporter (NET) expressed in HEK cells
J Med Chem 42: 3647-56 (1999)
Article DOI: 10.1021/jm990161h
BindingDB Entry DOI: 10.7270/Q2BG2PPJ
Sodium-dependent serotonin transporter
(Homo sapiens (Human))
BDBM50080568
(1-{2-[Bis-(4-fluoro-phenyl)-methoxy]-ethyl}-4-phen...)
Show SMILES Fc1ccc(cc1)C(OCCN1CCN(CCc2ccccc2)CC1=O)c1ccc(F)cc1
Show InChI InChI=1S/C27H28F2N2O2/c28-24-10-6-22(7-11-24)27(23-8-12-25(29)13-9-23)33-19-18-31-17-16-30(20-26(31)32)15-14-21-4-2-1-3-5-21/h1-13,27H,14-20H2
n/an/a 3.94E+3n/an/an/an/an/an/a
Massachusetts General Hospital
Curated by ChEMBL
Assay Description
Inhibition of [3H]- 5-HT uptake in HEK cells expressing serotonin transporter
J Med Chem 42: 3647-56 (1999)
Article DOI: 10.1021/jm990161h
BindingDB Entry DOI: 10.7270/Q2BG2PPJ
Sodium-dependent dopamine transporter
(Homo sapiens (Human))
BDBM50080568
(1-{2-[Bis-(4-fluoro-phenyl)-methoxy]-ethyl}-4-phen...)
Show SMILES Fc1ccc(cc1)C(OCCN1CCN(CCc2ccccc2)CC1=O)c1ccc(F)cc1
Show InChI InChI=1S/C27H28F2N2O2/c28-24-10-6-22(7-11-24)27(23-8-12-25(29)13-9-23)33-19-18-31-17-16-30(20-26(31)32)15-14-21-4-2-1-3-5-21/h1-13,27H,14-20H2
NCI pathway
Reactome pathway
n/an/a>10n/an/an/an/an/an/a
Massachusetts General Hospital
Curated by ChEMBL
Assay Description
Inhibition of [3H]DA uptake in HEK cells expressing dopamine transporter
J Med Chem 42: 3647-56 (1999)
Article DOI: 10.1021/jm990161h
BindingDB Entry DOI: 10.7270/Q2BG2PPJ
Sodium-dependent noradrenaline transporter
(Homo sapiens (Human))
BDBM50080568
(1-{2-[Bis-(4-fluoro-phenyl)-methoxy]-ethyl}-4-phen...)
Show SMILES Fc1ccc(cc1)C(OCCN1CCN(CCc2ccccc2)CC1=O)c1ccc(F)cc1
Show InChI InChI=1S/C27H28F2N2O2/c28-24-10-6-22(7-11-24)27(23-8-12-25(29)13-9-23)33-19-18-31-17-16-30(20-26(31)32)15-14-21-4-2-1-3-5-21/h1-13,27H,14-20H2
Reactome pathway
n/an/a>10n/an/an/an/an/an/a
Massachusetts General Hospital
Curated by ChEMBL
Assay Description
Inhibition of [3H]- NE uptake in HEK cells expressing norepinephrine transporter
J Med Chem 42: 3647-56 (1999)
Article DOI: 10.1021/jm990161h
BindingDB Entry DOI: 10.7270/Q2BG2PPJ