BDBM50080572 CHEMBL333667::N-(2-{2-[Bis-(4-fluoro-phenyl)-methoxy]-ethylamino}-ethyl)-2-phenyl-acetamide
SMILES: Fc1ccc(cc1)C(OCCNCCNC(=O)Cc1ccccc1)c1ccc(F)cc1
InChI Key: InChIKey=ZOVQSSMFGDAFDJ-UHFFFAOYSA-N
Data: 3 KI  3 IC50
Activity Spreadsheet -- Enzyme Inhibition Constant Data from BindingDB
Found 6 hits for monomerid = 50080572
Trg + Lig
Ki
nM
ΔG°
kcal/mole
IC50
nM
Kd
nM
EC50/IC50
nM
koff
s-1
kon
M-1s-1
pHTemp
°C
Sodium-dependent dopamine transporter
(Homo sapiens (Human))
BDBM50080572
(CHEMBL333667 | N-(2-{2-[Bis-(4-fluoro-phenyl)-meth...)
Show SMILES Fc1ccc(cc1)C(OCCNCCNC(=O)Cc1ccccc1)c1ccc(F)cc1
Show InChI InChI=1S/C25H26F2N2O2/c26-22-10-6-20(7-11-22)25(21-8-12-23(27)13-9-21)31-17-16-28-14-15-29-24(30)18-19-4-2-1-3-5-19/h1-13,25,28H,14-18H2,(H,29,30)
NCI pathway
Reactome pathway
54n/an/an/an/an/an/an/an/a
Massachusetts General Hospital
Curated by ChEMBL
Assay Description
Inhibition of [125I]RTI-55 binding at Dopamine transporter (DAT) expressed in HEK cells
J Med Chem 42: 3647-56 (1999)
Article DOI: 10.1021/jm990161h
BindingDB Entry DOI: 10.7270/Q2BG2PPJ
Sodium-dependent serotonin transporter
(Homo sapiens (Human))
BDBM50080572
(CHEMBL333667 | N-(2-{2-[Bis-(4-fluoro-phenyl)-meth...)
Show SMILES Fc1ccc(cc1)C(OCCNCCNC(=O)Cc1ccccc1)c1ccc(F)cc1
Show InChI InChI=1S/C25H26F2N2O2/c26-22-10-6-20(7-11-22)25(21-8-12-23(27)13-9-21)31-17-16-28-14-15-29-24(30)18-19-4-2-1-3-5-19/h1-13,25,28H,14-18H2,(H,29,30)
556n/an/an/an/an/an/an/an/a
Massachusetts General Hospital
Curated by ChEMBL
Assay Description
Inhibition of [125I]RTI-55 binding to serotonin transporter (SERT) expressed in HEK cells
J Med Chem 42: 3647-56 (1999)
Article DOI: 10.1021/jm990161h
BindingDB Entry DOI: 10.7270/Q2BG2PPJ
Sodium-dependent noradrenaline transporter
(Homo sapiens (Human))
BDBM50080572
(CHEMBL333667 | N-(2-{2-[Bis-(4-fluoro-phenyl)-meth...)
Show SMILES Fc1ccc(cc1)C(OCCNCCNC(=O)Cc1ccccc1)c1ccc(F)cc1
Show InChI InChI=1S/C25H26F2N2O2/c26-22-10-6-20(7-11-22)25(21-8-12-23(27)13-9-21)31-17-16-28-14-15-29-24(30)18-19-4-2-1-3-5-19/h1-13,25,28H,14-18H2,(H,29,30)
Reactome pathway
604n/an/an/an/an/an/an/an/a
Massachusetts General Hospital
Curated by ChEMBL
Assay Description
Inhibition of [125I]RTI-55 binding to norepinephrine transporter (NET) expressed in HEK cells
J Med Chem 42: 3647-56 (1999)
Article DOI: 10.1021/jm990161h
BindingDB Entry DOI: 10.7270/Q2BG2PPJ
Sodium-dependent noradrenaline transporter
(Homo sapiens (Human))
BDBM50080572
(CHEMBL333667 | N-(2-{2-[Bis-(4-fluoro-phenyl)-meth...)
Show SMILES Fc1ccc(cc1)C(OCCNCCNC(=O)Cc1ccccc1)c1ccc(F)cc1
Show InChI InChI=1S/C25H26F2N2O2/c26-22-10-6-20(7-11-22)25(21-8-12-23(27)13-9-21)31-17-16-28-14-15-29-24(30)18-19-4-2-1-3-5-19/h1-13,25,28H,14-18H2,(H,29,30)
Reactome pathway
n/an/a 399n/an/an/an/an/an/a
Massachusetts General Hospital
Curated by ChEMBL
Assay Description
Inhibition of [3H]- NE uptake in HEK cells expressing norepinephrine transporter
J Med Chem 42: 3647-56 (1999)
Article DOI: 10.1021/jm990161h
BindingDB Entry DOI: 10.7270/Q2BG2PPJ
Sodium-dependent serotonin transporter
(Homo sapiens (Human))
BDBM50080572
(CHEMBL333667 | N-(2-{2-[Bis-(4-fluoro-phenyl)-meth...)
Show SMILES Fc1ccc(cc1)C(OCCNCCNC(=O)Cc1ccccc1)c1ccc(F)cc1
Show InChI InChI=1S/C25H26F2N2O2/c26-22-10-6-20(7-11-22)25(21-8-12-23(27)13-9-21)31-17-16-28-14-15-29-24(30)18-19-4-2-1-3-5-19/h1-13,25,28H,14-18H2,(H,29,30)
n/an/a 1.30E+3n/an/an/an/an/an/a
Massachusetts General Hospital
Curated by ChEMBL
Assay Description
Inhibition of [3H]- 5-HT uptake in HEK cells expressing serotonin transporter
J Med Chem 42: 3647-56 (1999)
Article DOI: 10.1021/jm990161h
BindingDB Entry DOI: 10.7270/Q2BG2PPJ
Sodium-dependent dopamine transporter
(Homo sapiens (Human))
BDBM50080572
(CHEMBL333667 | N-(2-{2-[Bis-(4-fluoro-phenyl)-meth...)
Show SMILES Fc1ccc(cc1)C(OCCNCCNC(=O)Cc1ccccc1)c1ccc(F)cc1
Show InChI InChI=1S/C25H26F2N2O2/c26-22-10-6-20(7-11-22)25(21-8-12-23(27)13-9-21)31-17-16-28-14-15-29-24(30)18-19-4-2-1-3-5-19/h1-13,25,28H,14-18H2,(H,29,30)
NCI pathway
Reactome pathway
n/an/a 80n/an/an/an/an/an/a
Massachusetts General Hospital
Curated by ChEMBL
Assay Description
Inhibition of [3H]DA uptake in HEK cells expressing dopamine transporter
J Med Chem 42: 3647-56 (1999)
Article DOI: 10.1021/jm990161h
BindingDB Entry DOI: 10.7270/Q2BG2PPJ