BDBM50080628 (2R,3R,4S)-4-Benzo[1,3]dioxol-5-yl-1-[(2,2-dimethyl-1-phenyl-propylcarbamoyl)-methyl]-2-(4-methoxy-phenyl)-pyrrolidine-3-carboxylic acid; TFA::CHEMBL123316
SMILES: COc1ccc(cc1)[C@H]1[C@@H]([C@H](CN1CC(=O)NC(c1ccccc1)C(C)(C)C)c1ccc2OCOc2c1)C(O)=O
InChI Key: InChIKey=NSVNTHSZOXQBPE-PABHLWBGSA-N
Data: 2 IC50
Activity Spreadsheet -- Enzyme Inhibition Constant Data from BindingDB
Found 2 hits for monomerid = 50080628
Trg + Lig
Ki
nM
ΔG°
kcal/mole
IC50
nM
Kd
nM
EC50/IC50
nM
koff
s-1
kon
M-1s-1
pHTemp
°C
Endothelin-1 receptor
(Homo sapiens (Human))
BDBM50080628
((2R,3R,4S)-4-Benzo[1,3]dioxol-5-yl-1-[(2,2-dimethy...)
Show SMILES COc1ccc(cc1)[C@H]1[C@@H]([C@H](CN1CC(=O)NC(c1ccccc1)C(C)(C)C)c1ccc2OCOc2c1)C(O)=O
Show InChI InChI=1S/C32H36N2O6/c1-32(2,3)30(21-8-6-5-7-9-21)33-27(35)18-34-17-24(22-12-15-25-26(16-22)40-19-39-25)28(31(36)37)29(34)20-10-13-23(38-4)14-11-20/h5-16,24,28-30H,17-19H2,1-4H3,(H,33,35)(H,36,37)/t24-,28-,29+,30?/m1/s1
n/an/a 8.80n/an/an/an/an/an/a
Abbott Laboratories
Curated by ChEMBL
Assay Description
Binding ability determined by the displacement of [125I]-ET-1 from the human endothelin A receptor
J Med Chem 42: 3679-89 (1999)
Article DOI: 10.1021/jm990171i
BindingDB Entry DOI: 10.7270/Q2125RVT
EDNRB
(Homo sapiens (Human))
BDBM50080628
((2R,3R,4S)-4-Benzo[1,3]dioxol-5-yl-1-[(2,2-dimethy...)
Show SMILES COc1ccc(cc1)[C@H]1[C@@H]([C@H](CN1CC(=O)NC(c1ccccc1)C(C)(C)C)c1ccc2OCOc2c1)C(O)=O
Show InChI InChI=1S/C32H36N2O6/c1-32(2,3)30(21-8-6-5-7-9-21)33-27(35)18-34-17-24(22-12-15-25-26(16-22)40-19-39-25)28(31(36)37)29(34)20-10-13-23(38-4)14-11-20/h5-16,24,28-30H,17-19H2,1-4H3,(H,33,35)(H,36,37)/t24-,28-,29+,30?/m1/s1
n/an/a 0.940n/an/an/an/an/an/a
Abbott Laboratories
Curated by ChEMBL
Assay Description
Binding ability determined by the displacement of [125 I]ET-3 from the human Endothelin B receptor
J Med Chem 42: 3679-89 (1999)
Article DOI: 10.1021/jm990171i
BindingDB Entry DOI: 10.7270/Q2125RVT