BDBM50081069 CHEMBL3421871
SMILES: [H][C@]12CCc3cc(O)ccc3[C@]1(CC)C[C@@](C)(O)[C@@](O)(C2)c1ccccc1
InChI Key: InChIKey=VWFKACUYWYZVSW-RLLPEYFOSA-N
Data: 7 IC50
Activity Spreadsheet -- Enzyme Inhibition Constant Data from BindingDB
Found 7 hits for monomerid = 50081069
Trg + Lig
Ki
nM
ΔG°
kcal/mole
IC50
nM
Kd
nM
EC50/IC50
nM
koff
s-1
kon
M-1s-1
pHTemp
°C
Glucocorticoid receptor
(Homo sapiens (Human))
BDBM50081069
(CHEMBL3421871)
Show SMILES [H][C@]12CCc3cc(O)ccc3[C@]1(CC)C[C@@](C)(O)[C@@](O)(C2)c1ccccc1 |r|
Show InChI InChI=1S/C23H28O3/c1-3-22-15-21(2,25)23(26,17-7-5-4-6-8-17)14-18(22)10-9-16-13-19(24)11-12-20(16)22/h4-8,11-13,18,24-26H,3,9-10,14-15H2,1-2H3/t18-,21-,22-,23-/m1/s1
n/an/a 3.5n/an/an/an/an/an/a
TBA
Curated by ChEMBL
Assay Description
Transrepression activity at glucocorticoid receptor in human SW1353 cells assessed as repression of IL-1-induced MMP-13 production after 24 hrs by EL...
J Med Chem 58: 2658-77 (2015)
Article DOI: 10.1021/jm501601b
BindingDB Entry DOI: 10.7270/Q2GM891C
Glucocorticoid receptor
(Homo sapiens (Human))
BDBM50081069
(CHEMBL3421871)
Show SMILES [H][C@]12CCc3cc(O)ccc3[C@]1(CC)C[C@@](C)(O)[C@@](O)(C2)c1ccccc1 |r|
Show InChI InChI=1S/C23H28O3/c1-3-22-15-21(2,25)23(26,17-7-5-4-6-8-17)14-18(22)10-9-16-13-19(24)11-12-20(16)22/h4-8,11-13,18,24-26H,3,9-10,14-15H2,1-2H3/t18-,21-,22-,23-/m1/s1
n/an/a 0.600n/an/an/an/an/an/a
TBA
Curated by ChEMBL
Assay Description
Binding affinity to human GR
J Med Chem 58: 2658-77 (2015)
Article DOI: 10.1021/jm501601b
BindingDB Entry DOI: 10.7270/Q2GM891C
Glucocorticoid receptor
(Homo sapiens (Human))
BDBM50081069
(CHEMBL3421871)
Show SMILES [H][C@]12CCc3cc(O)ccc3[C@]1(CC)C[C@@](C)(O)[C@@](O)(C2)c1ccccc1 |r|
Show InChI InChI=1S/C23H28O3/c1-3-22-15-21(2,25)23(26,17-7-5-4-6-8-17)14-18(22)10-9-16-13-19(24)11-12-20(16)22/h4-8,11-13,18,24-26H,3,9-10,14-15H2,1-2H3/t18-,21-,22-,23-/m1/s1
n/an/a 109n/an/an/an/an/an/a
TBA
Curated by ChEMBL
Assay Description
Transrepression activity at glucocorticoid receptor in human whole blood assessed as repression of IL-1-induced TNF-alpha production after 4 hrs by E...
J Med Chem 58: 2658-77 (2015)
Article DOI: 10.1021/jm501601b
BindingDB Entry DOI: 10.7270/Q2GM891C
Estradiol receptor beta (ERβ)
(Homo sapiens (Human))
BDBM50081069
(CHEMBL3421871)
Show SMILES [H][C@]12CCc3cc(O)ccc3[C@]1(CC)C[C@@](C)(O)[C@@](O)(C2)c1ccccc1 |r|
Show InChI InChI=1S/C23H28O3/c1-3-22-15-21(2,25)23(26,17-7-5-4-6-8-17)14-18(22)10-9-16-13-19(24)11-12-20(16)22/h4-8,11-13,18,24-26H,3,9-10,14-15H2,1-2H3/t18-,21-,22-,23-/m1/s1
n/an/a>3.20E+3n/an/an/an/an/an/a
TBA
Curated by ChEMBL
Assay Description
Binding affinity to human ER-beta
J Med Chem 58: 2658-77 (2015)
Article DOI: 10.1021/jm501601b
BindingDB Entry DOI: 10.7270/Q2GM891C
Progesterone receptor
(Homo sapiens (Human))
BDBM50081069
(CHEMBL3421871)
Show SMILES [H][C@]12CCc3cc(O)ccc3[C@]1(CC)C[C@@](C)(O)[C@@](O)(C2)c1ccccc1 |r|
Show InChI InChI=1S/C23H28O3/c1-3-22-15-21(2,25)23(26,17-7-5-4-6-8-17)14-18(22)10-9-16-13-19(24)11-12-20(16)22/h4-8,11-13,18,24-26H,3,9-10,14-15H2,1-2H3/t18-,21-,22-,23-/m1/s1
n/an/a 321n/an/an/an/an/an/a
TBA
Curated by ChEMBL
Assay Description
Binding affinity to human PR
J Med Chem 58: 2658-77 (2015)
Article DOI: 10.1021/jm501601b
BindingDB Entry DOI: 10.7270/Q2GM891C
Estrogen receptor
(Homo sapiens (Human))
BDBM50081069
(CHEMBL3421871)
Show SMILES [H][C@]12CCc3cc(O)ccc3[C@]1(CC)C[C@@](C)(O)[C@@](O)(C2)c1ccccc1 |r|
Show InChI InChI=1S/C23H28O3/c1-3-22-15-21(2,25)23(26,17-7-5-4-6-8-17)14-18(22)10-9-16-13-19(24)11-12-20(16)22/h4-8,11-13,18,24-26H,3,9-10,14-15H2,1-2H3/t18-,21-,22-,23-/m1/s1
n/an/a>3.20E+3n/an/an/an/an/an/a
TBA
Curated by ChEMBL
Assay Description
Binding affinity to human ER-alpha
J Med Chem 58: 2658-77 (2015)
Article DOI: 10.1021/jm501601b
BindingDB Entry DOI: 10.7270/Q2GM891C
Androgen Receptor
(Homo sapiens (Human))
BDBM50081069
(CHEMBL3421871)
Show SMILES [H][C@]12CCc3cc(O)ccc3[C@]1(CC)C[C@@](C)(O)[C@@](O)(C2)c1ccccc1 |r|
Show InChI InChI=1S/C23H28O3/c1-3-22-15-21(2,25)23(26,17-7-5-4-6-8-17)14-18(22)10-9-16-13-19(24)11-12-20(16)22/h4-8,11-13,18,24-26H,3,9-10,14-15H2,1-2H3/t18-,21-,22-,23-/m1/s1
NCI pathway
Reactome pathway
n/an/a 300n/an/an/an/an/an/a
TBA
Curated by ChEMBL
Assay Description
Binding affinity to human AR
J Med Chem 58: 2658-77 (2015)
Article DOI: 10.1021/jm501601b
BindingDB Entry DOI: 10.7270/Q2GM891C