BDBM50081079 CHEMBL3421886
SMILES: [H][C@]12CCc3cc(O)ccc3[C@]1(CC)C[C@@](C)(O)[C@@](O)(C2)C#CC
InChI Key: InChIKey=OHSVDENSKJRCTF-XLNTUCKNSA-N
Data: 2 IC50
Activity Spreadsheet -- Enzyme Inhibition Constant Data from BindingDB
Found 2 hits for monomerid = 50081079
Trg + Lig
Ki
nM
ΔG°
kcal/mole
IC50
nM
Kd
nM
EC50/IC50
nM
koff
s-1
kon
M-1s-1
pHTemp
°C
Glucocorticoid receptor
(Homo sapiens (Human))
BDBM50081079
(CHEMBL3421886)
Show SMILES [H][C@]12CCc3cc(O)ccc3[C@]1(CC)C[C@@](C)(O)[C@@](O)(C2)C#CC |r|
Show InChI InChI=1S/C20H26O3/c1-4-10-20(23)12-15-7-6-14-11-16(21)8-9-17(14)19(15,5-2)13-18(20,3)22/h8-9,11,15,21-23H,5-7,12-13H2,1-3H3/t15-,18-,19-,20+/m1/s1
n/an/a 1.90n/an/an/an/an/an/a
TBA
Curated by ChEMBL
Assay Description
Transrepression activity at glucocorticoid receptor in human SW1353 cells assessed as repression of IL-1-induced MMP-13 production after 24 hrs by EL...
J Med Chem 58: 2658-77 (2015)
Article DOI: 10.1021/jm501601b
BindingDB Entry DOI: 10.7270/Q2GM891C
Glucocorticoid receptor
(Homo sapiens (Human))
BDBM50081079
(CHEMBL3421886)
Show SMILES [H][C@]12CCc3cc(O)ccc3[C@]1(CC)C[C@@](C)(O)[C@@](O)(C2)C#CC |r|
Show InChI InChI=1S/C20H26O3/c1-4-10-20(23)12-15-7-6-14-11-16(21)8-9-17(14)19(15,5-2)13-18(20,3)22/h8-9,11,15,21-23H,5-7,12-13H2,1-3H3/t15-,18-,19-,20+/m1/s1
n/an/a 1.5n/an/an/an/an/an/a
TBA
Curated by ChEMBL
Assay Description
Binding affinity to human GR
J Med Chem 58: 2658-77 (2015)
Article DOI: 10.1021/jm501601b
BindingDB Entry DOI: 10.7270/Q2GM891C