BDBM50081175 CHEMBL3421975
SMILES: CS(=O)(=O)c1ccc(cc1)-c1nccc(n1)-c1c[nH]c2cnccc12
InChI Key: InChIKey=QEASAEABBPXQEO-UHFFFAOYSA-N
Data: 4 IC50
Activity Spreadsheet -- Enzyme Inhibition Constant Data from BindingDB
Found 4 hits for monomerid = 50081175
Trg + Lig
Ki
nM
ΔG°
kcal/mole
IC50
nM
Kd
nM
EC50/IC50
nM
koff
s-1
kon
M-1s-1
pHTemp
°C
Dual-specificity tyrosine-regulated kinases 1B
(Homo sapiens (Human))
BDBM50081175
(CHEMBL3421975)
Show SMILES CS(=O)(=O)c1ccc(cc1)-c1nccc(n1)-c1c[nH]c2cnccc12
Show InChI InChI=1S/C18H14N4O2S/c1-25(23,24)13-4-2-12(3-5-13)18-20-9-7-16(22-18)15-10-21-17-11-19-8-6-14(15)17/h2-11,21H,1H3
n/an/a 21n/an/an/an/an/an/a
AstraZeneca
Curated by ChEMBL
Assay Description
Inhibition of recombinant Dyrk1B (unknown origin) using FITC-Asp-His-Thr-Gly-Phe-Leu-Thr-Glu-Tyr-Val-Ala-Thr-Arg-NH2 as substrate after 60 mins
J Med Chem 58: 2834-44 (2015)
Article DOI: 10.1021/acs.jmedchem.5b00098
BindingDB Entry DOI: 10.7270/Q23B61VW
Cyclin-dependent kinase 2
(Homo sapiens (Human))
BDBM50081175
(CHEMBL3421975)
Show SMILES CS(=O)(=O)c1ccc(cc1)-c1nccc(n1)-c1c[nH]c2cnccc12
Show InChI InChI=1S/C18H14N4O2S/c1-25(23,24)13-4-2-12(3-5-13)18-20-9-7-16(22-18)15-10-21-17-11-19-8-6-14(15)17/h2-11,21H,1H3
NCI pathway
Reactome pathway
n/an/a 1.69E+4n/an/an/an/an/an/a
AstraZeneca
Curated by ChEMBL
Assay Description
Inhibition of human recombinant full length C-terminal His6-tagged CDK2 expressed in baculovirus infected Sf21 insect cells using fluorescence substr...
J Med Chem 58: 2834-44 (2015)
Article DOI: 10.1021/acs.jmedchem.5b00098
BindingDB Entry DOI: 10.7270/Q23B61VW
Dual-specificity tyrosine-regulated kinases 1B
(Homo sapiens (Human))
BDBM50081175
(CHEMBL3421975)
Show SMILES CS(=O)(=O)c1ccc(cc1)-c1nccc(n1)-c1c[nH]c2cnccc12
Show InChI InChI=1S/C18H14N4O2S/c1-25(23,24)13-4-2-12(3-5-13)18-20-9-7-16(22-18)15-10-21-17-11-19-8-6-14(15)17/h2-11,21H,1H3
n/an/a 898n/an/an/an/an/an/a
AstraZeneca
Curated by ChEMBL
Assay Description
Inhibition of human full length C-terminal c-Myc tagged Dyrk1B phosphorylation overexpressed in monkey COS1 cells after 5 hrs by ELISA
J Med Chem 58: 2834-44 (2015)
Article DOI: 10.1021/acs.jmedchem.5b00098
BindingDB Entry DOI: 10.7270/Q23B61VW
Insulin-like growth factor I receptor
(Homo sapiens (Human))
BDBM50081175
(CHEMBL3421975)
Show SMILES CS(=O)(=O)c1ccc(cc1)-c1nccc(n1)-c1c[nH]c2cnccc12
Show InChI InChI=1S/C18H14N4O2S/c1-25(23,24)13-4-2-12(3-5-13)18-20-9-7-16(22-18)15-10-21-17-11-19-8-6-14(15)17/h2-11,21H,1H3
Reactome pathway
n/an/a>1.00E+5n/an/an/an/an/an/a
AstraZeneca
Curated by ChEMBL
Assay Description
Inhibition of human recombinant N-terminal His6-tagged IGF-1R using fluorescence substrate after 80 mins by caliper off-chip incubation mobility shif...
J Med Chem 58: 2834-44 (2015)
Article DOI: 10.1021/acs.jmedchem.5b00098
BindingDB Entry DOI: 10.7270/Q23B61VW