BDBM50081179 CHEMBL3421970
SMILES: COc1cc(ccc1Nc1nccc(n1)-c1c[nH]c2c(C)nccc12)N1CCN(C)CC1
InChI Key: InChIKey=JUSBGYZKUCMHQQ-UHFFFAOYSA-N
Data: 4 IC50
Activity Spreadsheet -- Enzyme Inhibition Constant Data from BindingDB
Found 4 hits for monomerid = 50081179
Trg + Lig
Ki
nM
ΔG°
kcal/mole
IC50
nM
Kd
nM
EC50/IC50
nM
koff
s-1
kon
M-1s-1
pHTemp
°C
Dual-specificity tyrosine-regulated kinases 1B
(Homo sapiens (Human))
BDBM50081179
(CHEMBL3421970)
Show SMILES COc1cc(ccc1Nc1nccc(n1)-c1c[nH]c2c(C)nccc12)N1CCN(C)CC1
Show InChI InChI=1S/C24H27N7O/c1-16-23-18(6-8-25-16)19(15-27-23)20-7-9-26-24(28-20)29-21-5-4-17(14-22(21)32-3)31-12-10-30(2)11-13-31/h4-9,14-15,27H,10-13H2,1-3H3,(H,26,28,29)
n/an/a 5n/an/an/an/an/an/a
AstraZeneca
Curated by ChEMBL
Assay Description
Inhibition of recombinant Dyrk1B (unknown origin) using FITC-Asp-His-Thr-Gly-Phe-Leu-Thr-Glu-Tyr-Val-Ala-Thr-Arg-NH2 as substrate after 60 mins
J Med Chem 58: 2834-44 (2015)
Article DOI: 10.1021/acs.jmedchem.5b00098
BindingDB Entry DOI: 10.7270/Q23B61VW
Cyclin-dependent kinase 2
(Homo sapiens (Human))
BDBM50081179
(CHEMBL3421970)
Show SMILES COc1cc(ccc1Nc1nccc(n1)-c1c[nH]c2c(C)nccc12)N1CCN(C)CC1
Show InChI InChI=1S/C24H27N7O/c1-16-23-18(6-8-25-16)19(15-27-23)20-7-9-26-24(28-20)29-21-5-4-17(14-22(21)32-3)31-12-10-30(2)11-13-31/h4-9,14-15,27H,10-13H2,1-3H3,(H,26,28,29)
NCI pathway
Reactome pathway
n/an/a 1.74E+4n/an/an/an/an/an/a
AstraZeneca
Curated by ChEMBL
Assay Description
Inhibition of human recombinant full length C-terminal His6-tagged CDK2 expressed in baculovirus infected Sf21 insect cells using fluorescence substr...
J Med Chem 58: 2834-44 (2015)
Article DOI: 10.1021/acs.jmedchem.5b00098
BindingDB Entry DOI: 10.7270/Q23B61VW
Dual-specificity tyrosine-regulated kinases 1B
(Homo sapiens (Human))
BDBM50081179
(CHEMBL3421970)
Show SMILES COc1cc(ccc1Nc1nccc(n1)-c1c[nH]c2c(C)nccc12)N1CCN(C)CC1
Show InChI InChI=1S/C24H27N7O/c1-16-23-18(6-8-25-16)19(15-27-23)20-7-9-26-24(28-20)29-21-5-4-17(14-22(21)32-3)31-12-10-30(2)11-13-31/h4-9,14-15,27H,10-13H2,1-3H3,(H,26,28,29)
n/an/a 83n/an/an/an/an/an/a
AstraZeneca
Curated by ChEMBL
Assay Description
Inhibition of human full length C-terminal c-Myc tagged Dyrk1B phosphorylation overexpressed in monkey COS1 cells after 5 hrs by ELISA
J Med Chem 58: 2834-44 (2015)
Article DOI: 10.1021/acs.jmedchem.5b00098
BindingDB Entry DOI: 10.7270/Q23B61VW
Insulin-like growth factor I receptor
(Homo sapiens (Human))
BDBM50081179
(CHEMBL3421970)
Show SMILES COc1cc(ccc1Nc1nccc(n1)-c1c[nH]c2c(C)nccc12)N1CCN(C)CC1
Show InChI InChI=1S/C24H27N7O/c1-16-23-18(6-8-25-16)19(15-27-23)20-7-9-26-24(28-20)29-21-5-4-17(14-22(21)32-3)31-12-10-30(2)11-13-31/h4-9,14-15,27H,10-13H2,1-3H3,(H,26,28,29)
Reactome pathway
n/an/a 51n/an/an/an/an/an/a
AstraZeneca
Curated by ChEMBL
Assay Description
Inhibition of human recombinant N-terminal His6-tagged IGF-1R using fluorescence substrate after 80 mins by caliper off-chip incubation mobility shif...
J Med Chem 58: 2834-44 (2015)
Article DOI: 10.1021/acs.jmedchem.5b00098
BindingDB Entry DOI: 10.7270/Q23B61VW