BDBM50081187 CHEMBL3421636
SMILES: CN1CCN(CC1)c1ccc(Nc2cc(ncn2)-c2c[nH]c3ccccc23)cc1
InChI Key: InChIKey=BMFODXAZKLMRNP-UHFFFAOYSA-N
Data: 4 IC50
Activity Spreadsheet -- Enzyme Inhibition Constant Data from BindingDB
Found 4 hits for monomerid = 50081187
Trg + Lig
Ki
nM
ΔG°
kcal/mole
IC50
nM
Kd
nM
EC50/IC50
nM
koff
s-1
kon
M-1s-1
pHTemp
°C
Dual-specificity tyrosine-regulated kinases 1B
(Homo sapiens (Human))
BDBM50081187
(CHEMBL3421636)
Show SMILES CN1CCN(CC1)c1ccc(Nc2cc(ncn2)-c2c[nH]c3ccccc23)cc1
Show InChI InChI=1S/C23H24N6/c1-28-10-12-29(13-11-28)18-8-6-17(7-9-18)27-23-14-22(25-16-26-23)20-15-24-21-5-3-2-4-19(20)21/h2-9,14-16,24H,10-13H2,1H3,(H,25,26,27)
n/an/a 85n/an/an/an/an/an/a
AstraZeneca
Curated by ChEMBL
Assay Description
Inhibition of recombinant Dyrk1B (unknown origin) using FITC-Asp-His-Thr-Gly-Phe-Leu-Thr-Glu-Tyr-Val-Ala-Thr-Arg-NH2 as substrate after 60 mins
J Med Chem 58: 2834-44 (2015)
Article DOI: 10.1021/acs.jmedchem.5b00098
BindingDB Entry DOI: 10.7270/Q23B61VW
Dual-specificity tyrosine-regulated kinases 1B
(Homo sapiens (Human))
BDBM50081187
(CHEMBL3421636)
Show SMILES CN1CCN(CC1)c1ccc(Nc2cc(ncn2)-c2c[nH]c3ccccc23)cc1
Show InChI InChI=1S/C23H24N6/c1-28-10-12-29(13-11-28)18-8-6-17(7-9-18)27-23-14-22(25-16-26-23)20-15-24-21-5-3-2-4-19(20)21/h2-9,14-16,24H,10-13H2,1H3,(H,25,26,27)
n/an/a 9.97E+3n/an/an/an/an/an/a
AstraZeneca
Curated by ChEMBL
Assay Description
Inhibition of human full length C-terminal c-Myc tagged Dyrk1B phosphorylation overexpressed in monkey COS1 cells after 5 hrs by ELISA
J Med Chem 58: 2834-44 (2015)
Article DOI: 10.1021/acs.jmedchem.5b00098
BindingDB Entry DOI: 10.7270/Q23B61VW
Insulin-like growth factor I receptor
(Homo sapiens (Human))
BDBM50081187
(CHEMBL3421636)
Show SMILES CN1CCN(CC1)c1ccc(Nc2cc(ncn2)-c2c[nH]c3ccccc23)cc1
Show InChI InChI=1S/C23H24N6/c1-28-10-12-29(13-11-28)18-8-6-17(7-9-18)27-23-14-22(25-16-26-23)20-15-24-21-5-3-2-4-19(20)21/h2-9,14-16,24H,10-13H2,1H3,(H,25,26,27)
Reactome pathway
n/an/a 2.41E+3n/an/an/an/an/an/a
AstraZeneca
Curated by ChEMBL
Assay Description
Inhibition of human recombinant N-terminal His6-tagged IGF-1R using fluorescence substrate after 80 mins by caliper off-chip incubation mobility shif...
J Med Chem 58: 2834-44 (2015)
Article DOI: 10.1021/acs.jmedchem.5b00098
BindingDB Entry DOI: 10.7270/Q23B61VW
Cyclin-dependent kinase 2
(Homo sapiens (Human))
BDBM50081187
(CHEMBL3421636)
Show SMILES CN1CCN(CC1)c1ccc(Nc2cc(ncn2)-c2c[nH]c3ccccc23)cc1
Show InChI InChI=1S/C23H24N6/c1-28-10-12-29(13-11-28)18-8-6-17(7-9-18)27-23-14-22(25-16-26-23)20-15-24-21-5-3-2-4-19(20)21/h2-9,14-16,24H,10-13H2,1H3,(H,25,26,27)
NCI pathway
Reactome pathway
n/an/a 3.32E+4n/an/an/an/an/an/a
AstraZeneca
Curated by ChEMBL
Assay Description
Inhibition of human recombinant full length C-terminal His6-tagged CDK2 expressed in baculovirus infected Sf21 insect cells using fluorescence substr...
J Med Chem 58: 2834-44 (2015)
Article DOI: 10.1021/acs.jmedchem.5b00098
BindingDB Entry DOI: 10.7270/Q23B61VW