BDBM50081191 CHEMBL3421978
SMILES: C(=C/c1nccc(n1)-c1c[nH]c2cnccc12)\c1ccccc1
InChI Key: InChIKey=SSUYSUSCBUXMBR-VOTSOKGWSA-N
Data: 4 IC50
Activity Spreadsheet -- Enzyme Inhibition Constant Data from BindingDB
Found 4 hits for monomerid = 50081191
Trg + Lig
Ki
nM
ΔG°
kcal/mole
IC50
nM
Kd
nM
EC50/IC50
nM
koff
s-1
kon
M-1s-1
pHTemp
°C
Insulin-like growth factor I receptor
(Homo sapiens (Human))
BDBM50081191
(CHEMBL3421978)
Show SMILES C(=C/c1nccc(n1)-c1c[nH]c2cnccc12)\c1ccccc1
Show InChI InChI=1S/C19H14N4/c1-2-4-14(5-3-1)6-7-19-21-11-9-17(23-19)16-12-22-18-13-20-10-8-15(16)18/h1-13,22H/b7-6+
Reactome pathway
n/an/a 4.69E+4n/an/an/an/an/an/a
AstraZeneca
Curated by ChEMBL
Assay Description
Inhibition of human recombinant N-terminal His6-tagged IGF-1R using fluorescence substrate after 80 mins by caliper off-chip incubation mobility shif...
J Med Chem 58: 2834-44 (2015)
Article DOI: 10.1021/acs.jmedchem.5b00098
BindingDB Entry DOI: 10.7270/Q23B61VW
Cyclin-dependent kinase 2
(Homo sapiens (Human))
BDBM50081191
(CHEMBL3421978)
Show SMILES C(=C/c1nccc(n1)-c1c[nH]c2cnccc12)\c1ccccc1
Show InChI InChI=1S/C19H14N4/c1-2-4-14(5-3-1)6-7-19-21-11-9-17(23-19)16-12-22-18-13-20-10-8-15(16)18/h1-13,22H/b7-6+
NCI pathway
Reactome pathway
n/an/a 5.18E+3n/an/an/an/an/an/a
AstraZeneca
Curated by ChEMBL
Assay Description
Inhibition of human recombinant full length C-terminal His6-tagged CDK2 expressed in baculovirus infected Sf21 insect cells using fluorescence substr...
J Med Chem 58: 2834-44 (2015)
Article DOI: 10.1021/acs.jmedchem.5b00098
BindingDB Entry DOI: 10.7270/Q23B61VW
Dual-specificity tyrosine-regulated kinases 1B
(Homo sapiens (Human))
BDBM50081191
(CHEMBL3421978)
Show SMILES C(=C/c1nccc(n1)-c1c[nH]c2cnccc12)\c1ccccc1
Show InChI InChI=1S/C19H14N4/c1-2-4-14(5-3-1)6-7-19-21-11-9-17(23-19)16-12-22-18-13-20-10-8-15(16)18/h1-13,22H/b7-6+
n/an/a 7n/an/an/an/an/an/a
AstraZeneca
Curated by ChEMBL
Assay Description
Inhibition of recombinant Dyrk1B (unknown origin) using FITC-Asp-His-Thr-Gly-Phe-Leu-Thr-Glu-Tyr-Val-Ala-Thr-Arg-NH2 as substrate after 60 mins
J Med Chem 58: 2834-44 (2015)
Article DOI: 10.1021/acs.jmedchem.5b00098
BindingDB Entry DOI: 10.7270/Q23B61VW
Dual-specificity tyrosine-regulated kinases 1B
(Homo sapiens (Human))
BDBM50081191
(CHEMBL3421978)
Show SMILES C(=C/c1nccc(n1)-c1c[nH]c2cnccc12)\c1ccccc1
Show InChI InChI=1S/C19H14N4/c1-2-4-14(5-3-1)6-7-19-21-11-9-17(23-19)16-12-22-18-13-20-10-8-15(16)18/h1-13,22H/b7-6+
n/an/a 192n/an/an/an/an/an/a
AstraZeneca
Curated by ChEMBL
Assay Description
Inhibition of human full length C-terminal c-Myc tagged Dyrk1B phosphorylation overexpressed in monkey COS1 cells after 5 hrs by ELISA
J Med Chem 58: 2834-44 (2015)
Article DOI: 10.1021/acs.jmedchem.5b00098
BindingDB Entry DOI: 10.7270/Q23B61VW